[Mondrian] Test failures with high-cardinality dimensions

Julian Hyde jhyde at pentaho.com
Sun Jul 6 13:48:35 EDT 2008


Luis, Jorge, Javier,

There are still some errors with high-cardinality dimensions. See below; and
also search for 'execHighCardTest' in
http://www.hydromatic.net/buildlogs/mondrian-marmalade.hydromatic.net-200807
05-change11263.log.bz2.

Do you know about these? Any idea what the cause is? When can they be fixed?

Julian

Running test with JDK=jdk1.6 retroweave= database=oracle props={
mondrian.test.highCardDimensions=Store}

[java] 1)
testAncestorNumeric(mondrian.olap.fun.FunctionTest)mondrian.olap.MondrianExc
eption: Mondrian Error:Failed to parse query 'select
{Ancestor([Store].[USA].[Washington], 1)} on columns from [Sales Ragged]'

[java] 2)
testAncestorWithHiddenParent(mondrian.olap.fun.FunctionTest)mondrian.olap.Mo
ndrianException: Mondrian Error:Failed to parse query 'select
{Ancestor([Store].[All Stores].[Israel].[Haifa], [Store].[Store Country])}
on columns from [Sales Ragged]'

[java] 3)
testOrdinal(mondrian.olap.fun.FunctionTest)mondrian.olap.MondrianException:
Mondrian Error:Failed to parse query 'with member [Measures].[Foo] as
'[Store].[All Stores].[USA].[Washington].ordinal' select {[Measures].[Foo]}
on columns from [Sales Ragged]'

[java] 4)
testLead(mondrian.test.RaggedHierarchyTest)mondrian.olap.MondrianException:
Mondrian Error:Failed to parse query 'select {[Store].[All
Stores].[Mexico].[DF].Lead(1)} on columns from [Sales Ragged]'

[java] 5)
testParentOfHaifa(mondrian.test.RaggedHierarchyTest)mondrian.olap.MondrianEx
ception: Mondrian Error:Failed to parse query 'select
{[Store].[Israel].[Haifa].Parent} on columns from [Sales Ragged]'

[java] 6)
testPrevMemberOfHaifa(mondrian.test.RaggedHierarchyTest)mondrian.olap.Mondri
anException: Mondrian Error:Failed to parse query 'select
{[Store].[Israel].[Haifa].PrevMember} on columns from [Sales Ragged]'

[java] 7)
testNextMemberOfTelAviv(mondrian.test.RaggedHierarchyTest)mondrian.olap.Mond
rianException: Mondrian Error:Failed to parse query 'select
{[Store].[Israel].[Tel Aviv].NextMember} on columns from [Sales Ragged]'

[java] 8)
testNextMemberOfBC(mondrian.test.RaggedHierarchyTest)mondrian.olap.MondrianE
xception: Mondrian Error:Failed to parse query 'select {[Store].[All
Stores].[Canada].[BC].NextMember} on columns from [Sales Ragged]'

[java] 9)
testAncestorOfHaifa(mondrian.test.RaggedHierarchyTest)mondrian.olap.Mondrian
Exception: Mondrian Error:Failed to parse query 'select
{Ancestor([Store].[Israel].[Haifa], [Store].[Store State])} on columns from
[Sales Ragged]'

[java] 10)
testDataSourceChangeListenerPlugin(mondrian.rolap.DataSourceChangeListenerTe
st)java.lang.ClassCastException: mondrian.rolap.NoCacheMemberReader cannot
be cast to mondrian.rolap.SmartMemberReader

[java] 11)
testLookupMemberCache(mondrian.rolap.NonEmptyTest)java.lang.ClassCastExcepti
on: mondrian.rolap.NoCacheMemberReader cannot be cast to
mondrian.rolap.SmartMemberReader

[java] 12)
testLookupMember2(mondrian.rolap.NonEmptyTest)mondrian.olap.MondrianExceptio
n: Mondrian Error:Failed to parse query 'select {[Store].[USA].[Washington]}
on columns from [Sales Ragged]'

[java] 1)
testCrossJoinAsteriskQuery(mondrian.olap.fun.FunctionTest)junit.framework.Co
mparisonFailure: Expected:

[java] 2)
testCalculatedMemberInCube(mondrian.test.TestCalculatedMembers)junit.framewo
rk.ComparisonFailure: Expected:

[java] 3)
testHierarchize(mondrian.test.RaggedHierarchyTest)junit.framework.Comparison
Failure: Expected:

[java] 4)
testDescendantsOfRootAtCity(mondrian.test.RaggedHierarchyTest)junit.framewor
k.ComparisonFailure: Expected:

[java] Tests run: 1856, Failures: 4, Errors: 12

-------------- next part --------------
An HTML attachment was scrubbed...
URL: http://lists.pentaho.org/pipermail/mondrian/attachments/20080706/ca4ccd13/attachment.html 


More information about the Mondrian mailing list