[Mondrian] Build failed in Jenkins: mondrian-mongo #2

buildguy at pentaho.com buildguy at pentaho.com
Tue Oct 15 12:36:54 EDT 2013


See <http://ci.pentaho.com/job/mondrian-mongo/2/>

------------------------------------------
[...truncated 26583 lines...]
  [antcall] Exiting <http://ci.pentaho.com/job/mondrian-mongo/ws/build.xml.>

install-antcontrib:
parsing buildfile jar:file:/home/buildguy/.subfloor/ant-contrib/ant-contrib-1.0b3.jar!/net/sf/antcontrib/antlib.xml with URI = jar:file:/home/buildguy/.subfloor/ant-contrib/ant-contrib-1.0b3.jar!/net/sf/antcontrib/antlib.xml
Trying to override old definition of task propertycopy
Trying to override old definition of task shellscript
Trying to override old definition of task pathtofileset
Trying to override old definition of task runtarget
Trying to override old definition of task remoteant
Trying to override old definition of task propertyregex
Trying to override old definition of task assert
Trying to override old definition of task math
Trying to override old definition of task trycatch
Trying to override old definition of task antserver
Trying to override old definition of task antcallback
Trying to override old definition of task compilewithwalls
Trying to override old definition of task outofdate
Trying to override old definition of task osfamily
Trying to override old definition of task stopwatch
Trying to override old definition of task throw
Trying to override old definition of task antclipse
Trying to override old definition of task urlencode
Trying to override old definition of task timestampselector
Trying to override old definition of task foreach
Trying to override old definition of task if
Trying to override old definition of task propertyselector
Trying to override old definition of task sortlist
Trying to override old definition of task antfetch
Trying to override old definition of task post
Trying to override old definition of task forget
Trying to override old definition of task limit
Trying to override old definition of task switch
Trying to override old definition of task relentless
Trying to override old definition of task var
Trying to override old definition of task inifile
Trying to override old definition of task verifydesign
Trying to override old definition of task for
Trying to override old definition of datatype httpState
Trying to override old definition of datatype httpClient
Trying to override old definition of task getCookie
Trying to override old definition of task addCookie
Trying to override old definition of task clearCookies
Trying to override old definition of task addCredentials
Trying to override old definition of task clearCredentials
Trying to override old definition of task purgeExpiredCookies
Trying to override old definition of task postMethod
Trying to override old definition of task getMethod
Trying to override old definition of task headMethod
Trying to override old definition of task importurl

maven-publish-dependencies:
[available] Found: dist/ivy.xml
Property "ivy.repository.publish" has not been set
     [echo] Publishing <http://ci.pentaho.com/job/mondrian-mongo/ws/dist/ivy.xml> to ${ivy.repository.publish}...
Property "ivy.repository.id" has not been set
Property "ivy.repository.publish" has not been set
     [exec] Current OS is Linux
     [exec] Executing 'mvn' with arguments:
     [exec] 'deploy:deploy-file'
     [exec] '-DrepositoryId=${ivy.repository.id}'
     [exec] '-Durl=${ivy.repository.publish}'
     [exec] '-DgroupId=pentaho'
     [exec] '-DartifactId=mondrian'
     [exec] '-Dversion=MONGO-SNAPSHOT'
     [exec] '-Dpackaging=ivy.xml'
     [exec] '-Dfile=<http://ci.pentaho.com/job/mondrian-mongo/ws/dist/ivy.xml'>
     [exec] '-e'
     [exec] 
     [exec] The ' characters around the executable and arguments are
     [exec] not part of the command.
     [exec] Running Pentaho Safeguarded mvn script...
     [exec] testing file argument [-Dfile=<http://ci.pentaho.com/job/mondrian-mongo/ws/dist/ivy.xml]>
     [exec] EE_ARTIFACT=[0]
     [exec] testing url argument [-Durl=${ivy.repository.publish}]
     [exec] OPEN_REPO=[0]
     [exec] testing version argument [-Dversion=MONGO-SNAPSHOT]
     [exec] EE_VERSION=[0]
     [exec] Executing maven publish command: [mvn deploy:deploy-file -DrepositoryId=${ivy.repository.id} -Durl=${ivy.repository.publish} -DgroupId=pentaho -DartifactId=mondrian -Dversion=MONGO-SNAPSHOT -Dpackaging=ivy.xml -Dfile=<http://ci.pentaho.com/job/mondrian-mongo/ws/dist/ivy.xml> -e]
     [exec] [INFO] Error stacktraces are turned on.
     [exec] [INFO] Scanning for projects...
     [exec] [INFO]                                                                         
     [exec] [INFO] ------------------------------------------------------------------------
     [exec] [INFO] Building Maven Stub Project (No POM) 1
     [exec] [INFO] ------------------------------------------------------------------------
     [exec] [INFO] 
     [exec] [INFO] --- maven-deploy-plugin:2.7:deploy-file (default-cli) @ standalone-pom ---
     [exec] [INFO] ------------------------------------------------------------------------
     [exec] [INFO] BUILD FAILURE
     [exec] [INFO] ------------------------------------------------------------------------
     [exec] [INFO] Total time: 0.986s
     [exec] [INFO] Finished at: Tue Oct 15 12:36:47 EDT 2013
     [exec] [INFO] Final Memory: 6M/303M
     [exec] [INFO] ------------------------------------------------------------------------
     [exec] [ERROR] Failed to execute goal org.apache.maven.plugins:maven-deploy-plugin:2.7:deploy-file (default-cli) on project standalone-pom: The parameters 'url' for goal org.apache.maven.plugins:maven-deploy-plugin:2.7:deploy-file are missing or invalid -> [Help 1]
     [exec] org.apache.maven.lifecycle.LifecycleExecutionException: Failed to execute goal org.apache.maven.plugins:maven-deploy-plugin:2.7:deploy-file (default-cli) on project standalone-pom: The parameters 'url' for goal org.apache.maven.plugins:maven-deploy-plugin:2.7:deploy-file are missing or invalid
     [exec] 	at org.apache.maven.lifecycle.internal.MojoExecutor.execute(MojoExecutor.java:221)
     [exec] 	at org.apache.maven.lifecycle.internal.MojoExecutor.execute(MojoExecutor.java:153)
     [exec] 	at org.apache.maven.lifecycle.internal.MojoExecutor.execute(MojoExecutor.java:145)
     [exec] 	at org.apache.maven.lifecycle.internal.LifecycleModuleBuilder.buildProject(LifecycleModuleBuilder.java:84)
     [exec] 	at org.apache.maven.lifecycle.internal.LifecycleModuleBuilder.buildProject(LifecycleModuleBuilder.java:59)
     [exec] 	at org.apache.maven.lifecycle.internal.LifecycleStarter.singleThreadedBuild(LifecycleStarter.java:183)
     [exec] 	at org.apache.maven.lifecycle.internal.LifecycleStarter.execute(LifecycleStarter.java:161)
     [exec] 	at org.apache.maven.DefaultMaven.doExecute(DefaultMaven.java:320)
     [exec] 	at org.apache.maven.DefaultMaven.execute(DefaultMaven.java:156)
     [exec] 	at org.apache.maven.cli.MavenCli.execute(MavenCli.java:537)
     [exec] 	at org.apache.maven.cli.MavenCli.doMain(MavenCli.java:196)
     [exec] 	at org.apache.maven.cli.MavenCli.main(MavenCli.java:141)
     [exec] 	at sun.reflect.NativeMethodAccessorImpl.invoke0(Native Method)
     [exec] 	at sun.reflect.NativeMethodAccessorImpl.invoke(NativeMethodAccessorImpl.java:57)
     [exec] 	at sun.reflect.DelegatingMethodAccessorImpl.invoke(DelegatingMethodAccessorImpl.java:43)
     [exec] 	at java.lang.reflect.Method.invoke(Method.java:601)
     [exec] 	at org.codehaus.plexus.classworlds.launcher.Launcher.launchEnhanced(Launcher.java:290)
     [exec] 	at org.codehaus.plexus.classworlds.launcher.Launcher.launch(Launcher.java:230)
     [exec] 	at org.codehaus.plexus.classworlds.launcher.Launcher.mainWithExitCode(Launcher.java:409)
     [exec] 	at org.codehaus.plexus.classworlds.launcher.Launcher.main(Launcher.java:352)
     [exec] Caused by: org.apache.maven.plugin.PluginParameterException: The parameters 'url' for goal org.apache.maven.plugins:maven-deploy-plugin:2.7:deploy-file are missing or invalid
     [exec] 	at org.apache.maven.plugin.internal.DefaultMavenPluginManager.populatePluginFields(DefaultMavenPluginManager.java:576)
     [exec] 	at org.apache.maven.plugin.internal.DefaultMavenPluginManager.getConfiguredMojo(DefaultMavenPluginManager.java:529)
     [exec] 	at org.apache.maven.plugin.DefaultBuildPluginManager.executeMojo(DefaultBuildPluginManager.java:92)
     [exec] 	at org.apache.maven.lifecycle.internal.MojoExecutor.execute(MojoExecutor.java:209)
     [exec] 	... 19 more
     [exec] [ERROR] 
     [exec] [ERROR] Re-run Maven using the -X switch to enable full debug logging.
     [exec] [ERROR] 
     [exec] [ERROR] For more information about the errors and possible solutions, please read the following articles:
     [exec] [ERROR] [Help 1] http://cwiki.apache.org/confluence/display/MAVEN/PluginParameterException
  [antcall] Exiting <http://ci.pentaho.com/job/mondrian-mongo/ws/build.xml.>

BUILD FAILED
<http://ci.pentaho.com/job/mondrian-mongo/ws/subfloor.xml>:853: The following error occurred while executing this line:
<http://ci.pentaho.com/job/mondrian-mongo/ws/subfloor.xml>:927: exec returned: 1
	at org.apache.tools.ant.ProjectHelper.addLocationToBuildException(ProjectHelper.java:508)
	at org.apache.tools.ant.taskdefs.Ant.execute(Ant.java:418)
	at org.apache.tools.ant.taskdefs.CallTarget.execute(CallTarget.java:105)
	at org.apache.tools.ant.UnknownElement.execute(UnknownElement.java:288)
	at sun.reflect.GeneratedMethodAccessor1.invoke(Unknown Source)
	at sun.reflect.DelegatingMethodAccessorImpl.invoke(DelegatingMethodAccessorImpl.java:43)
	at java.lang.reflect.Method.invoke(Method.java:601)
	at org.apache.tools.ant.dispatch.DispatchUtils.execute(DispatchUtils.java:106)
	at org.apache.tools.ant.Task.perform(Task.java:348)
	at org.apache.tools.ant.Target.execute(Target.java:357)
	at org.apache.tools.ant.Target.performTasks(Target.java:385)
	at org.apache.tools.ant.Project.executeSortedTargets(Project.java:1337)
	at org.apache.tools.ant.Project.executeTarget(Project.java:1306)
	at org.apache.tools.ant.helper.DefaultExecutor.executeTargets(DefaultExecutor.java:41)
	at org.apache.tools.ant.Project.executeTargets(Project.java:1189)
	at org.apache.tools.ant.Main.runBuild(Main.java:758)
	at org.apache.tools.ant.Main.startAnt(Main.java:217)
	at org.apache.tools.ant.launch.Launcher.run(Launcher.java:257)
	at org.apache.tools.ant.launch.Launcher.main(Launcher.java:104)
Caused by: <http://ci.pentaho.com/job/mondrian-mongo/ws/subfloor.xml>:927: exec returned: 1
	at org.apache.tools.ant.taskdefs.ExecTask.runExecute(ExecTask.java:636)
	at org.apache.tools.ant.taskdefs.ExecTask.runExec(ExecTask.java:662)
	at org.apache.tools.ant.taskdefs.ExecTask.execute(ExecTask.java:487)
	at org.apache.tools.ant.UnknownElement.execute(UnknownElement.java:288)
	at sun.reflect.GeneratedMethodAccessor1.invoke(Unknown Source)
	at sun.reflect.DelegatingMethodAccessorImpl.invoke(DelegatingMethodAccessorImpl.java:43)
	at java.lang.reflect.Method.invoke(Method.java:601)
	at org.apache.tools.ant.dispatch.DispatchUtils.execute(DispatchUtils.java:106)
	at org.apache.tools.ant.Task.perform(Task.java:348)
	at org.apache.tools.ant.taskdefs.Sequential.execute(Sequential.java:62)
	at net.sf.antcontrib.logic.IfTask.execute(IfTask.java:217)
	at sun.reflect.NativeMethodAccessorImpl.invoke0(Native Method)
	at sun.reflect.NativeMethodAccessorImpl.invoke(NativeMethodAccessorImpl.java:57)
	at sun.reflect.DelegatingMethodAccessorImpl.invoke(DelegatingMethodAccessorImpl.java:43)
	at java.lang.reflect.Method.invoke(Method.java:601)
	at org.apache.tools.ant.dispatch.DispatchUtils.execute(DispatchUtils.java:106)
	at org.apache.tools.ant.TaskAdapter.execute(TaskAdapter.java:154)
	at org.apache.tools.ant.UnknownElement.execute(UnknownElement.java:288)
	at sun.reflect.GeneratedMethodAccessor1.invoke(Unknown Source)
	at sun.reflect.DelegatingMethodAccessorImpl.invoke(DelegatingMethodAccessorImpl.java:43)
	at java.lang.reflect.Method.invoke(Method.java:601)
	at org.apache.tools.ant.dispatch.DispatchUtils.execute(DispatchUtils.java:106)
	at org.apache.tools.ant.Task.perform(Task.java:348)
	at org.apache.tools.ant.taskdefs.Sequential.execute(Sequential.java:62)
	at org.apache.tools.ant.UnknownElement.execute(UnknownElement.java:288)
	at sun.reflect.GeneratedMethodAccessor1.invoke(Unknown Source)
	at sun.reflect.DelegatingMethodAccessorImpl.invoke(DelegatingMethodAccessorImpl.java:43)
	at java.lang.reflect.Method.invoke(Method.java:601)
	at org.apache.tools.ant.dispatch.DispatchUtils.execute(DispatchUtils.java:106)
	at org.apache.tools.ant.Task.perform(Task.java:348)
	at org.apache.tools.ant.Target.execute(Target.java:357)
	at org.apache.tools.ant.Target.performTasks(Target.java:385)
	at org.apache.tools.ant.Project.executeSortedTargets(Project.java:1337)
	at org.apache.tools.ant.helper.SingleCheckExecutor.executeTargets(SingleCheckExecutor.java:38)
	at org.apache.tools.ant.Project.executeTargets(Project.java:1189)
	at org.apache.tools.ant.taskdefs.Ant.execute(Ant.java:416)
	... 17 more
--- Nested Exception ---
<http://ci.pentaho.com/job/mondrian-mongo/ws/subfloor.xml>:927: exec returned: 1
	at org.apache.tools.ant.taskdefs.ExecTask.runExecute(ExecTask.java:636)
	at org.apache.tools.ant.taskdefs.ExecTask.runExec(ExecTask.java:662)
	at org.apache.tools.ant.taskdefs.ExecTask.execute(ExecTask.java:487)
	at org.apache.tools.ant.UnknownElement.execute(UnknownElement.java:288)
	at sun.reflect.GeneratedMethodAccessor1.invoke(Unknown Source)
	at sun.reflect.DelegatingMethodAccessorImpl.invoke(DelegatingMethodAccessorImpl.java:43)
	at java.lang.reflect.Method.invoke(Method.java:601)
	at org.apache.tools.ant.dispatch.DispatchUtils.execute(DispatchUtils.java:106)
	at org.apache.tools.ant.Task.perform(Task.java:348)
	at org.apache.tools.ant.taskdefs.Sequential.execute(Sequential.java:62)
	at net.sf.antcontrib.logic.IfTask.execute(IfTask.java:217)
	at sun.reflect.NativeMethodAccessorImpl.invoke0(Native Method)
	at sun.reflect.NativeMethodAccessorImpl.invoke(NativeMethodAccessorImpl.java:57)
	at sun.reflect.DelegatingMethodAccessorImpl.invoke(DelegatingMethodAccessorImpl.java:43)
	at java.lang.reflect.Method.invoke(Method.java:601)
	at org.apache.tools.ant.dispatch.DispatchUtils.execute(DispatchUtils.java:106)
	at org.apache.tools.ant.TaskAdapter.execute(TaskAdapter.java:154)
	at org.apache.tools.ant.UnknownElement.execute(UnknownElement.java:288)
	at sun.reflect.GeneratedMethodAccessor1.invoke(Unknown Source)
	at sun.reflect.DelegatingMethodAccessorImpl.invoke(DelegatingMethodAccessorImpl.java:43)
	at java.lang.reflect.Method.invoke(Method.java:601)
	at org.apache.tools.ant.dispatch.DispatchUtils.execute(DispatchUtils.java:106)
	at org.apache.tools.ant.Task.perform(Task.java:348)
	at org.apache.tools.ant.taskdefs.Sequential.execute(Sequential.java:62)
	at org.apache.tools.ant.UnknownElement.execute(UnknownElement.java:288)
	at sun.reflect.GeneratedMethodAccessor1.invoke(Unknown Source)
	at sun.reflect.DelegatingMethodAccessorImpl.invoke(DelegatingMethodAccessorImpl.java:43)
	at java.lang.reflect.Method.invoke(Method.java:601)
	at org.apache.tools.ant.dispatch.DispatchUtils.execute(DispatchUtils.java:106)
	at org.apache.tools.ant.Task.perform(Task.java:348)
	at org.apache.tools.ant.Target.execute(Target.java:357)
	at org.apache.tools.ant.Target.performTasks(Target.java:385)
	at org.apache.tools.ant.Project.executeSortedTargets(Project.java:1337)
	at org.apache.tools.ant.helper.SingleCheckExecutor.executeTargets(SingleCheckExecutor.java:38)
	at org.apache.tools.ant.Project.executeTargets(Project.java:1189)
	at org.apache.tools.ant.taskdefs.Ant.execute(Ant.java:416)
	at org.apache.tools.ant.taskdefs.CallTarget.execute(CallTarget.java:105)
	at org.apache.tools.ant.UnknownElement.execute(UnknownElement.java:288)
	at sun.reflect.GeneratedMethodAccessor1.invoke(Unknown Source)
	at sun.reflect.DelegatingMethodAccessorImpl.invoke(DelegatingMethodAccessorImpl.java:43)
	at java.lang.reflect.Method.invoke(Method.java:601)
	at org.apache.tools.ant.dispatch.DispatchUtils.execute(DispatchUtils.java:106)
	at org.apache.tools.ant.Task.perform(Task.java:348)
	at org.apache.tools.ant.Target.execute(Target.java:357)
	at org.apache.tools.ant.Target.performTasks(Target.java:385)
	at org.apache.tools.ant.Project.executeSortedTargets(Project.java:1337)
	at org.apache.tools.ant.Project.executeTarget(Project.java:1306)
	at org.apache.tools.ant.helper.DefaultExecutor.executeTargets(DefaultExecutor.java:41)
	at org.apache.tools.ant.Project.executeTargets(Project.java:1189)
	at org.apache.tools.ant.Main.runBuild(Main.java:758)
	at org.apache.tools.ant.Main.startAnt(Main.java:217)
	at org.apache.tools.ant.launch.Launcher.run(Launcher.java:257)
	at org.apache.tools.ant.launch.Launcher.main(Launcher.java:104)

Total time: 15 seconds
Build step 'Invoke Ant' marked build as failure
Archiving artifacts
Recording test results
Recording fingerprints



More information about the Mondrian mailing list