[Mondrian] Build failed in Jenkins: mondrian #1350

buildguy at pentaho.com buildguy at pentaho.com
Mon Mar 12 21:23:56 EDT 2012


See <http://ci.pentaho.com/job/mondrian/1350/changes>

Changes:

[Julian Hyde] MONDRIAN: Update copyright notices, reflecting copyright changes:
	    Julian Hyde, 2005 and later => Pentaho
	    Kana Software, Inc. => Julian Hyde
	
	    Also remove '$Id' tags (they don't work well on git).

------------------------------------------
Started by an SCM change
Building on master
Using master perforce client: mondrian.ci.pentaho.com
[workspace] $ /opt/perforce/bin/p4 workspace -o mondrian.ci.pentaho.com
Saving modified client mondrian.ci.pentaho.com
[workspace] $ /opt/perforce/bin/p4 -s client -i
Last build changeset: 14996
[workspace] $ /opt/perforce/bin/p4 counter change
[workspace] $ /opt/perforce/bin/p4 -s changes //mondrian.ci.pentaho.com/... at 14997, at 14998
[workspace] $ /opt/perforce/bin/p4 describe -s 14998
Sync'ing workspace to changelist 14998.
[workspace] $ /opt/perforce/bin/p4 -s sync //mondrian.ci.pentaho.com/... at 14998
Sync complete, took 14904 ms
[workspace] $ /bin/sh -xe /var/tmp/hudson229617.sh
+ rm -Rf junit-results
[workspace] $ /bin/sh -xe /var/tmp/hudson229618.sh
+ cp /build/resources/mondrian/cobertura_build.xml /build/resources/mondrian/common_build.xml <http://ci.pentaho.com/job/mondrian/ws/>
[workspace] $ /bin/sh -xe /var/tmp/hudson229619.sh
+ BUILDSCRIPT=<http://ci.pentaho.com/job/mondrian/ws/buildOnJdk.sh>
+ chmod a+wx <http://ci.pentaho.com/job/mondrian/ws/buildOnJdk.sh>
+ echo jdkVersion=$1
+ echo shift
+ echo case "$jdkVersion" in
+ echo (*) export JAVA_HOME=/usr/lib/jvm/${jdkVersion};;
+ echo esac
+ echo if [ ! -d $JAVA_HOME ]; then
+ echo     echo "$0: Invalid JAVA_HOME $JAVA_HOME; skipping compile."
+ echo     exit 1
+ echo fi
+ echo export PATH=$JAVA_HOME/bin:$PATH
+ echo /opt/ant1.7/bin/ant -Drequested.java.version="$jdkVersion" "$@"
[workspace] $ /opt/ant1.7/bin/ant -Divy.repository.id=pentaho -Divy.repository.publish=http://repository.pentaho.org/artifactory/pentaho -Dtests.skip=true -Dunix.script=<http://ci.pentaho.com/job/mondrian/ws/buildOnJdk.sh> clean-deep binzip workbench-dist publish
Buildfile: build.xml

clean-deep:

clean:

version:

checkIsJdk15:

antcontrib.download-check:

antcontrib.download:

install-antcontrib:

ivy.download-check:

ivy.download:

install-ivy:
     [echo] Installing IVY...

resolve:
     [echo] symlink=true
[ivy:resolve] :: Ivy 2.2.0 - 20100923230623 :: http://ant.apache.org/ivy/ ::
[ivy:resolve] :: loading settings :: url = <http://ci.pentaho.com/job/mondrian/ws/ivysettings.xml>
[ivy:resolve] :: resolving dependencies :: pentaho#mondrian-workbench;3.2-SNAPSHOT
[ivy:resolve] 	confs: [default]
[ivy:resolve] 	found commons-codec#commons-codec;1.2 in default
[ivy:resolve] 	found commons-httpclient#commons-httpclient;3.0.1 in default
[ivy:resolve] 	found commons-logging#commons-logging;1.0.3 in default
[ivy:resolve] 	found commons-lang#commons-lang;2.3 in ibiblio
[ivy:resolve] 	found commons-io#commons-io;1.3.2 in ibiblio
[ivy:resolve] 	found jaxen#jaxen;1.1.1 in default
[ivy:resolve] 	found dom4j#dom4j;1.6.1 in public
[ivy:resolve] 	found msv#xsdlib;20030807 in ibiblio
[ivy:resolve] 	found msv#relaxngDatatype;20030807 in ibiblio
[ivy:resolve] 	found pull-parser#pull-parser;2 in ibiblio
[ivy:resolve] 	found xpp3#xpp3;1.1.3.3 in ibiblio
[ivy:resolve] 	found stax#stax-api;1.0 in ibiblio
[ivy:resolve] 	found xml-apis#xml-apis;1.3.02 in default
[ivy:resolve] 	found jdom#jdom;1.0 in default
[ivy:resolve] 	found xom#xom;1.0 in default
[ivy:resolve] 	found xerces#xmlParserAPIs;2.6.2 in default
[ivy:resolve] 	found xalan#xalan;2.6.0 in default
[ivy:resolve] 	found com.ibm.icu#icu4j;2.6.1 in default
[ivy:resolve] 	found junit#junit;4.0 in ibiblio
[ivy:resolve] 	found pentaho#pentaho-mondrianschemaworkbench-plugins;1.0.49156 in pentaho-rep
[ivy:resolve] 	found pentaho#pentaho-xul-core;3.3.3 in pentaho-rep
[ivy:resolve] 	found pentaho#pentaho-xul-swing;3.3.3 in pentaho-rep
[ivy:resolve] 	found commons-beanutils#commons-beanutils;1.6 in default
[ivy:resolve] 	found org.codehaus.groovy#groovy-all;1.5.6 in default
[ivy:resolve] 	found pentaho-kettle#kettle-core;4.3.0-RC1 in pentaho-rep
[ivy:resolve] 	found pentaho-kettle#kettle-db;4.3.0-RC1 in pentaho-rep
[ivy:resolve] 	found pentaho-kettle#kettle-engine;4.3.0-RC1 in pentaho-rep
[ivy:resolve] 	found pentaho-kettle#kettle-dbdialog;4.3.0-RC1 in pentaho-rep
[ivy:resolve] 	found xerces#xercesImpl;2.9.1 in default
[ivy:resolve] 	found xml-apis#xml-apis;1.3.04 in default
[ivy:resolve] 	found xml-resolver#xml-resolver;1.2 in ibiblio
[ivy:resolve] 	found pentaho#pentaho-application-launcher;1.0.2 in pentaho-rep
[ivy:resolve] downloading http://repo.pentaho.org/artifactory/repo/pentaho-kettle/kettle-engine/4.3.0-RC1/kettle-engine-4.3.0-RC1.jar ...
[ivy:resolve] ...................................................................................
[ivy:resolve] ................................................................................................................
[ivy:resolve] ....................................................................................................................................................
[ivy:resolve] ........................................................................
[ivy:resolve] ................................................................................................................................................
[ivy:resolve] ..............................................................................................................................................................................................................
[ivy:resolve] ....................................................................... (6808kB)
[ivy:resolve] :: resolution report :: resolve 6946ms :: artifacts dl 9906ms
[ivy:resolve] 	:: evicted modules:
[ivy:resolve] 	junit#junit;3.8.1 by [junit#junit;4.0] in [default]
[ivy:resolve] 	xml-apis#xml-apis;1.0.b2 by [xml-apis#xml-apis;1.3.02] in [default]
[ivy:resolve] 	jaxen#jaxen;1.1-beta-6 by [jaxen#jaxen;1.1.1] in [default]
[ivy:resolve] 	xml-apis#xml-apis;1.3.02 by [xml-apis#xml-apis;1.3.04] in [default]
[ivy:resolve] 	xerces#xercesImpl;2.6.2 by [xerces#xercesImpl;2.9.1] in [default]
[ivy:resolve] 	xml-apis#xml-apis;2.0.2 by [xml-apis#xml-apis;1.3.02] in [default]
	---------------------------------------------------------------------
	|                  |            modules            ||   artifacts   |
	|       conf       | number| search|dwnlded|evicted|| number|dwnlded|
	---------------------------------------------------------------------
	|      default     |   37  |   6   |   0   |   6   ||   41  |   0   |
	---------------------------------------------------------------------
[ivy:resolve] 
[ivy:resolve] :: problems summary ::
[ivy:resolve] :::: WARNINGS
[ivy:resolve] 		[FAILED     ] pentaho-kettle#kettle-engine;4.3.0-RC1!kettle-engine.jar: Downloaded file size doesn't match expected Content Length for http://repo.pentaho.org/artifactory/repo/pentaho-kettle/kettle-engine/4.3.0-RC1/kettle-engine-4.3.0-RC1.jar. Please retry. (9847ms)
[ivy:resolve] 
[ivy:resolve] :: USE VERBOSE OR DEBUG MESSAGE LEVEL FOR MORE DETAILS
[ivy:retrieve] :: retrieving :: pentaho#mondrian-workbench
[ivy:retrieve] 	confs: [default]
[ivy:retrieve] 	22 artifacts copied, 8 already retrieved (11837kB/2647ms)
[ivy:retrieve] :: retrieving :: pentaho#mondrian-workbench
[ivy:retrieve] 	confs: [default]
[ivy:retrieve] 	11 artifacts copied, 0 already retrieved (6419kB/1618ms)
[ivy:resolve] :: resolving dependencies :: pentaho#mondrian;3.4.0-SNAPSHOT
[ivy:resolve] 	confs: [codegen, default, default-jdk1.4, sources, dist, test]
[ivy:resolve] 	found commons-collections#commons-collections;3.2 in public
[ivy:resolve] 	found commons-dbcp#commons-dbcp;1.2.1 in public
[ivy:resolve] 	found commons-pool#commons-pool;1.2 in public
[ivy:resolve] 	found xerces#xerces;2.0.2 in public
[ivy:resolve] 	found commons-lang#commons-lang;2.4 in public
[ivy:resolve] 	found commons-io#commons-io;1.4 in public
[ivy:resolve] 	found commons-logging#commons-logging;1.1.1 in public
[ivy:resolve] 	found commons-math#commons-math;1.1 in public
[ivy:resolve] 	found commons-vfs#commons-vfs;1.0 in public
[ivy:resolve] 	found javacup#javacup;10k in default
[ivy:resolve] 	found net.java.dev.javacc#javacc;5.0 in public
[ivy:resolve] 	found dom4j#dom4j;1.6.1 in public
[ivy:resolve] 	found javax.validation#validation-api;1.0.0.GA in default
[ivy:resolve] 	found eigenbase#eigenbase-xom;1.3.0.13768 in default
[ivy:resolve] 	found eigenbase#eigenbase-properties;1.1.0.10924 in default
[ivy:resolve] 	found eigenbase#eigenbase-resgen;1.3.0.13768 in default
[ivy:resolve] 	found sun#jlfgr;1.0 in default
[ivy:resolve] 	found javax.servlet#jsp-api;2.0 in default
[ivy:resolve] 	found javax.servlet#servlet-api;2.4 in public
[ivy:resolve] 	found log4j#log4j;1.2.14 in public
[ivy:resolve] 	found org.olap4j#olap4j;1.0.1.500 in default
[ivy:resolve] 	found xalan#xalan;2.4.1 in public
[ivy:resolve] 	found xerces#xercesImpl;2.5.0 in default
[ivy:resolve] 	found backport-util-concurrent#backport-util-concurrent;3.1 in default
[ivy:resolve] 	found asm#asm;3.1 in default
[ivy:resolve] 	found asm#asm-commons;3.1 in ibiblio
[ivy:resolve] 	found asm#asm-tree;3.1 in ibiblio
[ivy:resolve] 	found asm#asm-util;3.1 in ibiblio
[ivy:resolve] 	found retroweaver#retroweaver;2.0.7 in pentaho-rep
[ivy:resolve] 	found retroweaver#retroweaver-rt;2.0.7 in default
[ivy:resolve] 	found org.apache.derby#derby;10.2.2.0 in default
[ivy:resolve] 	found hsqldb#hsqldb;1.8.0 in default
[ivy:resolve] 	found com.tonbeller#jpivot;1.8.0-100420 in default
[ivy:resolve] 	found org.olap4j#olap4j-tck;1.0.1.500 in pentaho-rep
[ivy:resolve] 	found org.olap4j#olap4j-xmla;1.0.1.500 in pentaho-rep
[ivy:resolve] 	found junit#junit;3.8.1 in public
[ivy:resolve] 	found xmlunit#xmlunit;1.1 in default
[ivy:resolve] downloading http://repo.pentaho.org/artifactory/repo/org/olap4j/olap4j/1.0.1.500/olap4j-1.0.1.500.jar ...
[ivy:resolve] .......................................... (288kB)
[ivy:resolve] :: resolution report :: resolve 4295ms :: artifacts dl 1788ms
[ivy:resolve] 	:: evicted modules:
[ivy:resolve] 	commons-collections#commons-collections;2.1 by [commons-collections#commons-collections;3.2] in [default]
[ivy:resolve] 	xerces#xercesImpl;2.0.2 by [xerces#xercesImpl;2.5.0] in [default]
[ivy:resolve] 	commons-logging#commons-logging;1.0.3 by [commons-logging#commons-logging;1.1.1] in [default]
[ivy:resolve] 	commons-logging#commons-logging;1.0.4 by [commons-logging#commons-logging;1.1.1] in [default]
	---------------------------------------------------------------------
	|                  |            modules            ||   artifacts   |
	|       conf       | number| search|dwnlded|evicted|| number|dwnlded|
	---------------------------------------------------------------------
	|      codegen     |   0   |   0   |   0   |   0   ||   0   |   0   |
	|      default     |   27  |   0   |   0   |   4   ||   22  |   0   |
	|  default-jdk1.4  |   7   |   0   |   0   |   0   ||   7   |   0   |
	|      sources     |   2   |   0   |   0   |   0   ||   2   |   0   |
	|       dist       |   3   |   0   |   0   |   0   ||   3   |   0   |
	|       test       |   4   |   2   |   0   |   0   ||   4   |   0   |
	---------------------------------------------------------------------
[ivy:resolve] 
[ivy:resolve] :: problems summary ::
[ivy:resolve] :::: WARNINGS
[ivy:resolve] 		[FAILED     ] org.olap4j#olap4j;1.0.1.500!olap4j.jar(source): Downloaded file size doesn't match expected Content Length for http://repo.pentaho.org/artifactory/repo/org/olap4j/olap4j/1.0.1.500/olap4j-1.0.1.500.jar. Please retry. (1434ms)
[ivy:resolve] 		[FAILED     ] org.olap4j#olap4j;1.0.1.500!olap4j.jar(source):  (0ms)
[ivy:resolve] 	==== pentaho-rep: tried
[ivy:resolve] 	  http://repo.pentaho.org/artifactory/repo/org/olap4j/olap4j/1.0.1.500/olap4j-1.0.1.500.jar
[ivy:resolve] 	==== ibiblio: tried
[ivy:resolve] 	  http://repo1.maven.org/maven2/org/olap4j/olap4j/1.0.1.500/olap4j-1.0.1.500-sources.jar
[ivy:resolve] 	==== public: tried
[ivy:resolve] 	  http://repo1.maven.org/maven2/org/olap4j/olap4j/1.0.1.500/olap4j-1.0.1.500-sources.jar
[ivy:resolve] 		::::::::::::::::::::::::::::::::::::::::::::::
[ivy:resolve] 		::              FAILED DOWNLOADS            ::
[ivy:resolve] 		:: ^ see resolution messages for details  ^ ::
[ivy:resolve] 		::::::::::::::::::::::::::::::::::::::::::::::
[ivy:resolve] 		:: org.olap4j#olap4j;1.0.1.500!olap4j.jar(source)
[ivy:resolve] 		::::::::::::::::::::::::::::::::::::::::::::::
[ivy:resolve] 
[ivy:resolve] :: USE VERBOSE OR DEBUG MESSAGE LEVEL FOR MORE DETAILS

BUILD FAILED
<http://ci.pentaho.com/job/mondrian/ws/build.xml>:410: impossible to resolve dependencies:
	resolve failed - see output for details

Total time: 49 seconds
Build step 'Invoke Ant' marked build as failure
Archiving artifacts
Recording test results
Recording fingerprints



More information about the Mondrian mailing list