[Mondrian] Build failed in Jenkins: mondrian #1257

buildguy at pentaho.com buildguy at pentaho.com
Tue Nov 15 13:53:46 EST 2011


See <http://ci.pentaho.com/job/mondrian/1257/changes>

Changes:

[Julian Hyde] MONDRIAN: Strip away ExecutionException wrappers.

------------------------------------------
[...truncated 29 lines...]
version:

checkIsJdk15:

antcontrib.download-check:

antcontrib.download:

install-antcontrib:

ivy.download-check:

ivy.download:

install-ivy:
     [echo] Installing IVY...

resolve:
     [echo] symlink=true
[ivy:resolve] :: Ivy 2.2.0 - 20100923230623 :: http://ant.apache.org/ivy/ ::
[ivy:resolve] :: loading settings :: url = <http://ci.pentaho.com/job/mondrian/ws/ivysettings.xml>
[ivy:resolve] :: resolving dependencies :: pentaho#mondrian-workbench;3.2-SNAPSHOT
[ivy:resolve] 	confs: [default]
[ivy:resolve] 	found commons-codec#commons-codec;1.2 in default
[ivy:resolve] 	found commons-httpclient#commons-httpclient;3.0.1 in default
[ivy:resolve] 	found commons-logging#commons-logging;1.0.3 in ibiblio
[ivy:resolve] 	found commons-lang#commons-lang;2.3 in ibiblio
[ivy:resolve] 	found commons-io#commons-io;1.3.2 in ibiblio
[ivy:resolve] 	found jaxen#jaxen;1.1.1 in default
[ivy:resolve] 	found dom4j#dom4j;1.6.1 in public
[ivy:resolve] 	found msv#xsdlib;20030807 in ibiblio
[ivy:resolve] 	found msv#relaxngDatatype;20030807 in ibiblio
[ivy:resolve] 	found pull-parser#pull-parser;2 in ibiblio
[ivy:resolve] 	found xpp3#xpp3;1.1.3.3 in ibiblio
[ivy:resolve] 	found stax#stax-api;1.0 in ibiblio
[ivy:resolve] 	found xml-apis#xml-apis;1.3.02 in default
[ivy:resolve] 	found jdom#jdom;1.0 in default
[ivy:resolve] 	found xom#xom;1.0 in default
[ivy:resolve] 	found xerces#xmlParserAPIs;2.6.2 in default
[ivy:resolve] 	found xalan#xalan;2.6.0 in default
[ivy:resolve] 	found com.ibm.icu#icu4j;2.6.1 in default
[ivy:resolve] 	found junit#junit;4.0 in ibiblio
[ivy:resolve] 	found pentaho#pentaho-mondrianschemaworkbench-plugins;1.0.42455 in pentaho-rep
[ivy:resolve] 	found pentaho#pentaho-xul-core;3.3.2 in pentaho-rep
[ivy:resolve] 	found pentaho#pentaho-xul-swing;3.3.2 in pentaho-rep
[ivy:resolve] 	found commons-beanutils#commons-beanutils;1.6 in default
[ivy:resolve] 	found org.codehaus.groovy#groovy-all;1.5.6 in default
[ivy:resolve] 	found pentaho-kettle#kettle-core;4.2.0-GA in pentaho-rep
[ivy:resolve] 	found pentaho-kettle#kettle-db;4.2.0-GA in pentaho-rep
[ivy:resolve] 	found pentaho-kettle#kettle-engine;4.2.0-GA in pentaho-rep
[ivy:resolve] 	found pentaho-kettle#kettle-dbdialog;4.2.0-GA in pentaho-rep
[ivy:resolve] 	found xerces#xercesImpl;2.9.1 in default
[ivy:resolve] 	found xml-apis#xml-apis;1.3.04 in default
[ivy:resolve] 	found xml-resolver#xml-resolver;1.2 in ibiblio
[ivy:resolve] 	found pentaho#launcher;1.0.0 in pentaho-rep
[ivy:resolve] downloading http://repo.pentaho.org/artifactory/repo/pentaho/pentaho-xul-core/3.3.2/pentaho-xul-core-3.3.2.jar ...
[ivy:resolve] ....................... (174kB)
[ivy:resolve] .. (0kB)
[ivy:resolve] downloading http://repo.pentaho.org/artifactory/repo/pentaho/pentaho-xul-swing/3.3.2/pentaho-xul-swing-3.3.2.jar ...
[ivy:resolve] ......................... (177kB)
[ivy:resolve] .. (0kB)
[ivy:resolve] 	[SUCCESSFUL ] pentaho#pentaho-xul-swing;3.3.2!pentaho-xul-swing.jar (1159ms)
[ivy:resolve] downloading http://repo.pentaho.org/artifactory/repo/pentaho-kettle/kettle-core/4.2.0-GA/kettle-core-4.2.0-GA.jar ...
[ivy:resolve] ................................................ (439kB)
[ivy:resolve] .. (0kB)
[ivy:resolve] 	[SUCCESSFUL ] pentaho-kettle#kettle-core;4.2.0-GA!kettle-core.jar (1824ms)
[ivy:resolve] downloading http://repo.pentaho.org/artifactory/repo/pentaho-kettle/kettle-db/4.2.0-GA/kettle-db-4.2.0-GA.jar ...
[ivy:resolve] ..................................... (279kB)
[ivy:resolve] .. (0kB)
[ivy:resolve] 	[SUCCESSFUL ] pentaho-kettle#kettle-db;4.2.0-GA!kettle-db.jar (1568ms)
[ivy:resolve] downloading http://repo.pentaho.org/artifactory/repo/pentaho-kettle/kettle-engine/4.2.0-GA/kettle-engine-4.2.0-GA.jar ...
[ivy:resolve] ...................................................
[ivy:resolve] ...............................................................................................................
[ivy:resolve] ..............................................................................................
[ivy:resolve] .................................
[ivy:resolve] ..................................................................
[ivy:resolve] ..........................................................................
[ivy:resolve] .............................................................
[ivy:resolve] ...............................................................................................................
[ivy:resolve] ...............................................................................................
[ivy:resolve] .............................................................................................................
[ivy:resolve] ............................................ (6801kB)
[ivy:resolve] .. (0kB)
[ivy:resolve] 	[SUCCESSFUL ] pentaho-kettle#kettle-engine;4.2.0-GA!kettle-engine.jar (17211ms)
[ivy:resolve] downloading http://repo.pentaho.org/artifactory/repo/pentaho-kettle/kettle-dbdialog/4.2.0-GA/kettle-dbdialog-4.2.0-GA.jar ...
[ivy:resolve] ...... (36kB)
[ivy:resolve] .. (0kB)
[ivy:resolve] 	[SUCCESSFUL ] pentaho-kettle#kettle-dbdialog;4.2.0-GA!kettle-dbdialog.jar (803ms)
[ivy:resolve] downloading http://repo.pentaho.org/artifactory/repo/pentaho/launcher/1.0.0/launcher-1.0.0.jar ...
[ivy:resolve] .. (5kB)
[ivy:resolve] .. (0kB)
[ivy:resolve] 	[SUCCESSFUL ] pentaho#launcher;1.0.0!launcher.jar (735ms)
[ivy:resolve] :: resolution report :: resolve 16505ms :: artifacts dl 24782ms
[ivy:resolve] 	:: evicted modules:
[ivy:resolve] 	junit#junit;3.8.1 by [junit#junit;4.0] in [default]
[ivy:resolve] 	xml-apis#xml-apis;1.0.b2 by [xml-apis#xml-apis;1.3.02] in [default]
[ivy:resolve] 	jaxen#jaxen;1.1-beta-6 by [jaxen#jaxen;1.1.1] in [default]
[ivy:resolve] 	xml-apis#xml-apis;1.3.02 by [xml-apis#xml-apis;1.3.04] in [default]
[ivy:resolve] 	xerces#xercesImpl;2.6.2 by [xerces#xercesImpl;2.9.1] in [default]
[ivy:resolve] 	xml-apis#xml-apis;2.0.2 by [xml-apis#xml-apis;1.3.02] in [default]
	---------------------------------------------------------------------
	|                  |            modules            ||   artifacts   |
	|       conf       | number| search|dwnlded|evicted|| number|dwnlded|
	---------------------------------------------------------------------
	|      default     |   37  |   8   |   0   |   6   ||   41  |   6   |
	---------------------------------------------------------------------
[ivy:resolve] 
[ivy:resolve] :: problems summary ::
[ivy:resolve] :::: WARNINGS
[ivy:resolve] 		[FAILED     ] pentaho#pentaho-xul-core;3.3.2!pentaho-xul-core.jar: /home/tomcat/.ivy2/cache/pentaho/pentaho-xul-core/jars/pentaho-xul-core-3.3.2.jar.part (No such file or directory) (1348ms)
[ivy:resolve] :::: ERRORS
[ivy:resolve] 	unknown resolver pentaho-chained-resolver
[ivy:resolve] 	unknown resolver pentaho-chained-resolver
[ivy:resolve] 	unknown resolver pentaho-chained-resolver
[ivy:resolve] 	unknown resolver pentaho-chained-resolver
[ivy:resolve] 	unknown resolver pentaho-chained-resolver
[ivy:resolve] 	unknown resolver pentaho-chained-resolver
[ivy:resolve] 	unknown resolver pentaho-chained-resolver
[ivy:resolve] 	unknown resolver pentaho-chained-resolver
[ivy:resolve] 	unknown resolver pentaho-chained-resolver
[ivy:resolve] 	unknown resolver pentaho-chained-resolver
[ivy:resolve] 	unknown resolver pentaho-chained-resolver
[ivy:resolve] 	unknown resolver pentaho-chained-resolver
[ivy:resolve] 	unknown resolver pentaho-chained-resolver
[ivy:resolve] 	unknown resolver pentaho-chained-resolver
[ivy:resolve] 	unknown resolver pentaho-chained-resolver
[ivy:resolve] 	unknown resolver pentaho-chained-resolver
[ivy:resolve] 	unknown resolver pentaho-chained-resolver
[ivy:resolve] 	unknown resolver pentaho-chained-resolver
[ivy:resolve] 	unknown resolver pentaho-chained-resolver
[ivy:resolve] 	unknown resolver pentaho-chained-resolver
[ivy:resolve] 	unknown resolver pentaho-chained-resolver
[ivy:resolve] 
[ivy:resolve] :: USE VERBOSE OR DEBUG MESSAGE LEVEL FOR MORE DETAILS
[ivy:retrieve] :: retrieving :: pentaho#mondrian-workbench
[ivy:retrieve] 	confs: [default]
[ivy:retrieve] 	22 artifacts copied, 8 already retrieved (11837kB/2944ms)
[ivy:retrieve] :: retrieving :: pentaho#mondrian-workbench
[ivy:retrieve] 	confs: [default]
[ivy:retrieve] 	11 artifacts copied, 0 already retrieved (6419kB/1904ms)
[ivy:resolve] :: resolving dependencies :: pentaho#mondrian;3.3-SNAPSHOT
[ivy:resolve] 	confs: [codegen, default, default-jdk1.4, sources, dist, test]
[ivy:resolve] 	found commons-collections#commons-collections;3.2 in public
[ivy:resolve] 	found commons-dbcp#commons-dbcp;1.2.1 in public
[ivy:resolve] 	found commons-pool#commons-pool;1.2 in public
[ivy:resolve] 	found xerces#xerces;2.0.2 in public
[ivy:resolve] 	found commons-lang#commons-lang;2.4 in public
[ivy:resolve] 	found commons-io#commons-io;1.4 in public
[ivy:resolve] 	found commons-logging#commons-logging;1.1.1 in public
[ivy:resolve] 	found commons-math#commons-math;1.1 in public
[ivy:resolve] 	found commons-vfs#commons-vfs;1.0 in public
[ivy:resolve] 	found javacup#javacup;10k in default
[ivy:resolve] 	found net.java.dev.javacc#javacc;5.0 in public
[ivy:resolve] 	found dom4j#dom4j;1.6.1 in public
[ivy:resolve] 	found eigenbase#eigenbase-xom;1.3.0.13768 in default
[ivy:resolve] 	found eigenbase#eigenbase-properties;1.1.0.10924 in default
[ivy:resolve] 	found eigenbase#eigenbase-resgen;1.3.0.13768 in default
[ivy:resolve] 	found sun#jlfgr;1.0 in default
[ivy:resolve] 	found javax.servlet#jsp-api;2.0 in default
[ivy:resolve] 	found javax.servlet#servlet-api;2.4 in public
[ivy:resolve] 	found log4j#log4j;1.2.9 in default
[ivy:resolve] 	found org.olap4j#olap4j;1.0.0-SNAPSHOT in pentaho-rep
[ivy:resolve] 	found xalan#xalan;2.4.1 in public
[ivy:resolve] 	found xerces#xercesImpl;2.5.0 in public
[ivy:resolve] 	found backport-util-concurrent#backport-util-concurrent;3.1 in default
[ivy:resolve] 	found asm#asm;3.1 in default
[ivy:resolve] 	found asm#asm-commons;3.1 in ibiblio
[ivy:resolve] 	found asm#asm-tree;3.1 in ibiblio
[ivy:resolve] 	found asm#asm-util;3.1 in ibiblio
[ivy:resolve] 	found retroweaver#retroweaver;2.0.7 in pentaho-rep
[ivy:resolve] 	found retroweaver#retroweaver-rt;2.0.7 in default
[ivy:resolve] 	found org.apache.derby#derby;10.2.2.0 in ibiblio
[ivy:resolve] 	found hsqldb#hsqldb;1.8.0 in default
[ivy:resolve] 	found com.tonbeller#jpivot;1.8.0-100420 in default
[ivy:resolve] 	found org.olap4j#olap4j-tck;1.0.0-SNAPSHOT in pentaho-rep
[ivy:resolve] 	found org.olap4j#olap4j-xmla;1.0.0-SNAPSHOT in pentaho-rep
[ivy:resolve] 	found junit#junit;3.8.1 in public
[ivy:resolve] 	found xmlunit#xmlunit;1.1 in default
[ivy:resolve] downloading http://repo.pentaho.org/artifactory/repo/org/olap4j/olap4j/1.0.0-SNAPSHOT/olap4j-1.0.0-SNAPSHOT.jar ...
[ivy:resolve] ...................................... (287kB)
[ivy:resolve] .. (0kB)
[ivy:resolve] 	[SUCCESSFUL ] org.olap4j#olap4j;1.0.0-SNAPSHOT!olap4j.jar(source) (1496ms)
[ivy:resolve] downloading http://repo.pentaho.org/artifactory/repo/org/olap4j/olap4j/1.0.0-SNAPSHOT/olap4j-1.0.0-SNAPSHOT.jar ...
[ivy:resolve] ........................................ (287kB)
[ivy:resolve] .. (0kB)
[ivy:resolve] 	[SUCCESSFUL ] org.olap4j#olap4j;1.0.0-SNAPSHOT!olap4j.jar (1304ms)
[ivy:resolve] downloading http://repo.pentaho.org/artifactory/repo/org/olap4j/olap4j-tck/1.0.0-SNAPSHOT/olap4j-tck-1.0.0-SNAPSHOT.jar ...
[ivy:resolve] .................. (129kB)
[ivy:resolve] .. (0kB)
[ivy:resolve] downloading http://repo.pentaho.org/artifactory/repo/org/olap4j/olap4j-xmla/1.0.0-SNAPSHOT/olap4j-xmla-1.0.0-SNAPSHOT.jar ...
[ivy:resolve] ........................... (196kB)
[ivy:resolve] .. (0kB)
[ivy:resolve] :: resolution report :: resolve 10599ms :: artifacts dl 5109ms
[ivy:resolve] 	:: evicted modules:
[ivy:resolve] 	commons-collections#commons-collections;2.1 by [commons-collections#commons-collections;3.2] in [default]
[ivy:resolve] 	xerces#xercesImpl;2.0.2 by [xerces#xercesImpl;2.5.0] in [default]
[ivy:resolve] 	commons-logging#commons-logging;1.0.3 by [commons-logging#commons-logging;1.1.1] in [default]
[ivy:resolve] 	commons-logging#commons-logging;1.0.4 by [commons-logging#commons-logging;1.1.1] in [default]
	---------------------------------------------------------------------
	|                  |            modules            ||   artifacts   |
	|       conf       | number| search|dwnlded|evicted|| number|dwnlded|
	---------------------------------------------------------------------
	|      codegen     |   0   |   0   |   0   |   0   ||   0   |   0   |
	|      default     |   26  |   1   |   0   |   4   ||   21  |   1   |
	|  default-jdk1.4  |   7   |   0   |   0   |   0   ||   7   |   0   |
	|      sources     |   1   |   1   |   0   |   0   ||   1   |   1   |
	|       dist       |   3   |   0   |   0   |   0   ||   3   |   0   |
	|       test       |   4   |   2   |   0   |   0   ||   4   |   0   |
	---------------------------------------------------------------------
[ivy:resolve] 
[ivy:resolve] :: problems summary ::
[ivy:resolve] :::: WARNINGS
[ivy:resolve] 		[FAILED     ] org.olap4j#olap4j-tck;1.0.0-SNAPSHOT!olap4j-tck.jar: invalid sha1: expected=b04a034ddd6ba1666e4d23d800906d056828e53e computed=e904826139b84058f620001548acb3692990286c (877ms)
[ivy:resolve] 		[FAILED     ] org.olap4j#olap4j-tck;1.0.0-SNAPSHOT!olap4j-tck.jar:  (0ms)
[ivy:resolve] 	==== pentaho-rep: tried
[ivy:resolve] 	  http://repo.pentaho.org/artifactory/repo/org/olap4j/olap4j-tck/1.0.0-SNAPSHOT/olap4j-tck-1.0.0-SNAPSHOT.jar
[ivy:resolve] 	==== ibiblio: tried
[ivy:resolve] 	  http://repo1.maven.org/maven2/org/olap4j/olap4j-tck/1.0.0-SNAPSHOT/olap4j-tck-1.0.0-SNAPSHOT.jar
[ivy:resolve] 	==== public: tried
[ivy:resolve] 	  http://repo1.maven.org/maven2/org/olap4j/olap4j-tck/1.0.0-SNAPSHOT/olap4j-tck-1.0.0-SNAPSHOT.jar
[ivy:resolve] 		[FAILED     ] org.olap4j#olap4j-xmla;1.0.0-SNAPSHOT!olap4j-xmla.jar: /home/tomcat/.ivy2/cache/org.olap4j/olap4j-xmla/jars/olap4j-xmla-1.0.0-SNAPSHOT.jar.part (No such file or directory) (1378ms)
[ivy:resolve] 		::::::::::::::::::::::::::::::::::::::::::::::
[ivy:resolve] 		::              FAILED DOWNLOADS            ::
[ivy:resolve] 		:: ^ see resolution messages for details  ^ ::
[ivy:resolve] 		::::::::::::::::::::::::::::::::::::::::::::::
[ivy:resolve] 		:: org.olap4j#olap4j-tck;1.0.0-SNAPSHOT!olap4j-tck.jar
[ivy:resolve] 		::::::::::::::::::::::::::::::::::::::::::::::
[ivy:resolve] :::: ERRORS
[ivy:resolve] 	unknown resolver pentaho-chained-resolver
[ivy:resolve] 	unknown resolver pentaho-chained-resolver
[ivy:resolve] 	unknown resolver pentaho-chained-resolver
[ivy:resolve] 	unknown resolver pentaho-chained-resolver
[ivy:resolve] 	unknown resolver pentaho-chained-resolver
[ivy:resolve] 	unknown resolver pentaho-chained-resolver
[ivy:resolve] 	unknown resolver pentaho-chained-resolver
[ivy:resolve] 	unknown resolver pentaho-chained-resolver
[ivy:resolve] 	unknown resolver pentaho-chained-resolver
[ivy:resolve] 
[ivy:resolve] :: USE VERBOSE OR DEBUG MESSAGE LEVEL FOR MORE DETAILS

BUILD FAILED
<http://ci.pentaho.com/job/mondrian/ws/build.xml>:400: impossible to resolve dependencies:
	resolve failed - see output for details

Total time: 1 minute 18 seconds
Build step 'Invoke Ant' marked build as failure
Recording test results
Archiving artifacts
Recording fingerprints



More information about the Mondrian mailing list