[Mondrian] Build failed in Jenkins: mondrian #1253

buildguy at pentaho.com buildguy at pentaho.com
Fri Nov 11 16:17:35 EST 2011


See <http://ci.pentaho.com/job/mondrian/1253/changes>

Changes:

[Luc Boudreau] MONDRIAN: [MONDRIAN-1040] The DelegatingTupleList.slice() method was mixing up the column and index variables.

------------------------------------------
Started by an SCM change
Building on master
Using master perforce client: mondrian.ci.pentaho.com
[workspace] $ /opt/perforce/bin/p4 workspace -o mondrian.ci.pentaho.com
Saving modified client mondrian.ci.pentaho.com
[workspace] $ /opt/perforce/bin/p4 -s client -i
Last build changeset: 14751
[workspace] $ /opt/perforce/bin/p4 counter change
[workspace] $ /opt/perforce/bin/p4 -s changes //mondrian.ci.pentaho.com/... at 14752, at 14754
[workspace] $ /opt/perforce/bin/p4 describe -s 14754
Sync'ing workspace to changelist 14754.
[workspace] $ /opt/perforce/bin/p4 -s sync //mondrian.ci.pentaho.com/... at 14754
Sync complete, took 704 ms
[workspace] $ /bin/sh -xe /var/tmp/hudson66610.sh
+ rm -Rf junit-results
[workspace] $ /bin/sh -xe /var/tmp/hudson66611.sh
+ cp /build/resources/mondrian/cobertura_build.xml /build/resources/mondrian/common_build.xml <http://ci.pentaho.com/job/mondrian/ws/>
[workspace] $ /bin/sh -xe /var/tmp/hudson66612.sh
+ BUILDSCRIPT=<http://ci.pentaho.com/job/mondrian/ws/buildOnJdk.sh>
+ BUILDSCRIPT_CUSTOM=<http://ci.pentaho.com/job/mondrian/ws/buildOnJdk-custom.sh>
+ sed -e s/ant/\/opt\/ant1.7\/bin\/ant/g <http://ci.pentaho.com/job/mondrian/ws/buildOnJdk.sh>
+ chmod a+x <http://ci.pentaho.com/job/mondrian/ws/buildOnJdk-custom.sh>
[workspace] $ /opt/ant1.7/bin/ant -Divy.repository.id=pentaho -Divy.repository.publish=http://repository.pentaho.org/artifactory/pentaho -Dunix.script=<http://ci.pentaho.com/job/mondrian/ws/buildOnJdk-custom.sh> clean-deep binzip workbench-dist publish
Buildfile: build.xml

clean-deep:

clean:

version:

checkIsJdk15:

antcontrib.download-check:

antcontrib.download:

install-antcontrib:

ivy.download-check:

ivy.download:

install-ivy:
     [echo] Installing IVY...

resolve:
     [echo] symlink=true
[ivy:resolve] :: Ivy 2.2.0 - 20100923230623 :: http://ant.apache.org/ivy/ ::
[ivy:resolve] :: loading settings :: url = <http://ci.pentaho.com/job/mondrian/ws/ivysettings.xml>
[ivy:resolve] :: resolving dependencies :: pentaho#mondrian-workbench;3.2-SNAPSHOT
[ivy:resolve] 	confs: [default]
[ivy:resolve] 	found commons-codec#commons-codec;1.2 in default
[ivy:resolve] 	found commons-httpclient#commons-httpclient;3.0.1 in default
[ivy:resolve] 	found commons-logging#commons-logging;1.0.3 in ibiblio
[ivy:resolve] 	found commons-lang#commons-lang;2.3 in ibiblio
[ivy:resolve] 	found commons-io#commons-io;1.3.2 in ibiblio
[ivy:resolve] 	found jaxen#jaxen;1.1.1 in default
[ivy:resolve] 	found dom4j#dom4j;1.6.1 in public
[ivy:resolve] 	found msv#xsdlib;20030807 in ibiblio
[ivy:resolve] 	found msv#relaxngDatatype;20030807 in ibiblio
[ivy:resolve] 	found pull-parser#pull-parser;2 in ibiblio
[ivy:resolve] 	found xpp3#xpp3;1.1.3.3 in ibiblio
[ivy:resolve] 	found stax#stax-api;1.0 in ibiblio
[ivy:resolve] 	found xml-apis#xml-apis;1.3.02 in default
[ivy:resolve] 	found jdom#jdom;1.0 in default
[ivy:resolve] 	found xom#xom;1.0 in default
[ivy:resolve] 	found xerces#xmlParserAPIs;2.6.2 in default
[ivy:resolve] 	found xalan#xalan;2.6.0 in default
[ivy:resolve] 	found com.ibm.icu#icu4j;2.6.1 in default
[ivy:resolve] 	found junit#junit;4.0 in ibiblio
[ivy:resolve] 	found pentaho#pentaho-mondrianschemaworkbench-plugins;1.0.42455 in pentaho-rep
[ivy:resolve] 	found pentaho#pentaho-xul-core;3.3.2 in pentaho-rep
[ivy:resolve] 	found pentaho#pentaho-xul-swing;3.3.2 in pentaho-rep
[ivy:resolve] 	found commons-beanutils#commons-beanutils;1.6 in default
[ivy:resolve] 	found org.codehaus.groovy#groovy-all;1.5.6 in default
[ivy:resolve] 	found pentaho-kettle#kettle-core;4.2.0-GA in pentaho-rep
[ivy:resolve] 	found pentaho-kettle#kettle-db;4.2.0-GA in pentaho-rep
[ivy:resolve] 	found pentaho-kettle#kettle-engine;4.2.0-GA in pentaho-rep
[ivy:resolve] 	found pentaho-kettle#kettle-dbdialog;4.2.0-GA in pentaho-rep
[ivy:resolve] 	found xerces#xercesImpl;2.9.1 in default
[ivy:resolve] 	found xml-apis#xml-apis;1.3.04 in default
[ivy:resolve] 	found xml-resolver#xml-resolver;1.2 in ibiblio
[ivy:resolve] 	found pentaho#launcher;1.0.0 in pentaho-rep
[ivy:resolve] downloading http://repo.pentaho.org/artifactory/repo/pentaho/pentaho-mondrianschemaworkbench-plugins/1.0.42455/pentaho-mondrianschemaworkbench-plugins-1.0.42455.jar ...
[ivy:resolve] ............... (84kB)
[ivy:resolve] .. (0kB)
[ivy:resolve] 	[SUCCESSFUL ] pentaho#pentaho-mondrianschemaworkbench-plugins;1.0.42455!pentaho-mondrianschemaworkbench-plugins.jar (886ms)
[ivy:resolve] downloading http://repo.pentaho.org/artifactory/repo/pentaho/pentaho-xul-core/3.3.2/pentaho-xul-core-3.3.2.jar ...
[ivy:resolve] ....................... (174kB)
[ivy:resolve] .. (0kB)
[ivy:resolve] 	[SUCCESSFUL ] pentaho#pentaho-xul-core;3.3.2!pentaho-xul-core.jar (1066ms)
[ivy:resolve] downloading http://repo.pentaho.org/artifactory/repo/pentaho/pentaho-xul-swing/3.3.2/pentaho-xul-swing-3.3.2.jar ...
[ivy:resolve] ................. (177kB)
[ivy:resolve] .. (0kB)
[ivy:resolve] downloading http://repo.pentaho.org/artifactory/repo/pentaho-kettle/kettle-core/4.2.0-GA/kettle-core-4.2.0-GA.jar ...
[ivy:resolve] .............................................................. (439kB)
[ivy:resolve] .. (0kB)
[ivy:resolve] downloading http://repo.pentaho.org/artifactory/repo/pentaho-kettle/kettle-db/4.2.0-GA/kettle-db-4.2.0-GA.jar ...
[ivy:resolve] ...............................
[ivy:resolve] ........ (279kB)
[ivy:resolve] .. (0kB)
[ivy:resolve] downloading http://repo.pentaho.org/artifactory/repo/pentaho-kettle/kettle-engine/4.2.0-GA/kettle-engine-4.2.0-GA.jar ...
[ivy:resolve] ........................................
[ivy:resolve] ................................................................................
[ivy:resolve] ..........................................................................................................................
[ivy:resolve] .....................................................................................................................
[ivy:resolve] .............................................................................................................
[ivy:resolve] ................................................................................
[ivy:resolve] ................................................................................................................................
[ivy:resolve] ........................................................................
[ivy:resolve] ............................................................................................................... (6801kB)
[ivy:resolve] downloading http://repo.pentaho.org/artifactory/repo/pentaho/launcher/1.0.0/launcher-1.0.0.jar ...
[ivy:resolve] .. (5kB)
[ivy:resolve] .. (0kB)
[ivy:resolve] :: resolution report :: resolve 14179ms :: artifacts dl 21472ms
[ivy:resolve] 	:: evicted modules:
[ivy:resolve] 	junit#junit;3.8.1 by [junit#junit;4.0] in [default]
[ivy:resolve] 	xml-apis#xml-apis;1.0.b2 by [xml-apis#xml-apis;1.3.02] in [default]
[ivy:resolve] 	jaxen#jaxen;1.1-beta-6 by [jaxen#jaxen;1.1.1] in [default]
[ivy:resolve] 	xml-apis#xml-apis;1.3.02 by [xml-apis#xml-apis;1.3.04] in [default]
[ivy:resolve] 	xerces#xercesImpl;2.6.2 by [xerces#xercesImpl;2.9.1] in [default]
[ivy:resolve] 	xml-apis#xml-apis;2.0.2 by [xml-apis#xml-apis;1.3.02] in [default]
	---------------------------------------------------------------------
	|                  |            modules            ||   artifacts   |
	|       conf       | number| search|dwnlded|evicted|| number|dwnlded|
	---------------------------------------------------------------------
	|      default     |   37  |   8   |   0   |   6   ||   41  |   2   |
	---------------------------------------------------------------------
[ivy:resolve] 
[ivy:resolve] :: problems summary ::
[ivy:resolve] :::: WARNINGS
[ivy:resolve] 		[FAILED     ] pentaho#pentaho-xul-swing;3.3.2!pentaho-xul-swing.jar: invalid sha1: expected=5760e1c7bfe2c78f57ad3797c144129746e8a5ce computed=fdf1bb7783d396a60eeced4e5556a3911c64a145 (987ms)
[ivy:resolve] 		[FAILED     ] pentaho#pentaho-xul-swing;3.3.2!pentaho-xul-swing.jar:  (0ms)
[ivy:resolve] 	==== pentaho-rep: tried
[ivy:resolve] 	  http://repo.pentaho.org/artifactory/repo/pentaho/pentaho-xul-swing/3.3.2/pentaho-xul-swing-3.3.2.jar
[ivy:resolve] 	==== ibiblio: tried
[ivy:resolve] 	  http://repo1.maven.org/maven2/pentaho/pentaho-xul-swing/3.3.2/pentaho-xul-swing-3.3.2.jar
[ivy:resolve] 	==== public: tried
[ivy:resolve] 	  http://repo1.maven.org/maven2/pentaho/pentaho-xul-swing/3.3.2/pentaho-xul-swing-3.3.2.jar
[ivy:resolve] 		[FAILED     ] pentaho-kettle#kettle-core;4.2.0-GA!kettle-core.jar: /home/tomcat/.ivy2/cache/pentaho-kettle/kettle-core/jars/kettle-core-4.2.0-GA.jar.part (No such file or directory) (1607ms)
[ivy:resolve] 		[FAILED     ] pentaho-kettle#kettle-db;4.2.0-GA!kettle-db.jar: /home/tomcat/.ivy2/cache/pentaho-kettle/kettle-db/jars/kettle-db-4.2.0-GA.jar.part (No such file or directory) (2317ms)
[ivy:resolve] 		[FAILED     ] pentaho-kettle#kettle-engine;4.2.0-GA!kettle-engine.jar: Downloaded file size doesn't match expected Content Length for http://repo.pentaho.org/artifactory/repo/pentaho-kettle/kettle-engine/4.2.0-GA/kettle-engine-4.2.0-GA.jar. Please retry. (13850ms)
[ivy:resolve] 		[FAILED     ] pentaho#launcher;1.0.0!launcher.jar: /home/tomcat/.ivy2/cache/pentaho/launcher/jars/launcher-1.0.0.jar.part (No such file or directory) (689ms)
[ivy:resolve] 		::::::::::::::::::::::::::::::::::::::::::::::
[ivy:resolve] 		::              FAILED DOWNLOADS            ::
[ivy:resolve] 		:: ^ see resolution messages for details  ^ ::
[ivy:resolve] 		::::::::::::::::::::::::::::::::::::::::::::::
[ivy:resolve] 		:: pentaho#pentaho-xul-swing;3.3.2!pentaho-xul-swing.jar
[ivy:resolve] 		::::::::::::::::::::::::::::::::::::::::::::::
[ivy:resolve] :::: ERRORS
[ivy:resolve] 	unknown resolver pentaho-chained-resolver
[ivy:resolve] 	unknown resolver pentaho-chained-resolver
[ivy:resolve] 	unknown resolver pentaho-chained-resolver
[ivy:resolve] 	unknown resolver pentaho-chained-resolver
[ivy:resolve] 	unknown resolver pentaho-chained-resolver
[ivy:resolve] 	unknown resolver pentaho-chained-resolver
[ivy:resolve] 	unknown resolver pentaho-chained-resolver
[ivy:resolve] 	unknown resolver pentaho-chained-resolver
[ivy:resolve] 	unknown resolver pentaho-chained-resolver
[ivy:resolve] 	unknown resolver pentaho-chained-resolver
[ivy:resolve] 	unknown resolver pentaho-chained-resolver
[ivy:resolve] 	unknown resolver pentaho-chained-resolver
[ivy:resolve] 	unknown resolver pentaho-chained-resolver
[ivy:resolve] 	unknown resolver pentaho-chained-resolver
[ivy:resolve] 	unknown resolver pentaho-chained-resolver
[ivy:resolve] 	unknown resolver pentaho-chained-resolver
[ivy:resolve] 	unknown resolver pentaho-chained-resolver
[ivy:resolve] 	unknown resolver pentaho-chained-resolver
[ivy:resolve] 	unknown resolver pentaho-chained-resolver
[ivy:resolve] 	unknown resolver pentaho-chained-resolver
[ivy:resolve] 	unknown resolver pentaho-chained-resolver
[ivy:resolve] 
[ivy:resolve] :: USE VERBOSE OR DEBUG MESSAGE LEVEL FOR MORE DETAILS

BUILD FAILED
<http://ci.pentaho.com/job/mondrian/ws/build.xml>:393: impossible to resolve dependencies:
	resolve failed - see output for details

Total time: 50 seconds
Build step 'Invoke Ant' marked build as failure
Recording test results
Archiving artifacts
Recording fingerprints



More information about the Mondrian mailing list