[Mondrian] Build failed in Hudson: mondrian-3.2 #298

buildguy at pentaho.com buildguy at pentaho.com
Wed Feb 2 10:04:25 EST 2011


See <http://ci.pentaho.com/job/mondrian-3.2/298/changes>

Changes:

[Luc Boudreau] MONDRIAN: Integrate change 14062 - Fix code formatting errors.

------------------------------------------
[...truncated 4 lines...]
Last sync'd change: 14060
[workspace] $ p4 counter change
[workspace] $ p4 -s changes //mondrian32.ci.pentaho.com/... at 14061, at 14064
[workspace] $ p4 describe -s 14063
Sync'ing workspace to changelist 14063.
[workspace] $ p4 sync //mondrian32.ci.pentaho.com/... at 14063
Sync complete, took 570 ms
[workspace] $ /bin/sh -xe /var/tmp/hudson637858.sh
+ rm -Rf junit-results
+ rm -rf <http://ci.pentaho.com/job/mondrian-3.2/ws/dist/*>
[workspace] $ /bin/sh -xe /var/tmp/hudson637859.sh
+ cp /build/resources/mondrian/cobertura_build.xml /build/resources/mondrian/common_build.xml <http://ci.pentaho.com/job/mondrian-3.2/ws/>
[workspace] $ /bin/sh -xe /var/tmp/hudson637860.sh
+ BUILDSCRIPT=<http://ci.pentaho.com/job/mondrian-3.2/ws/buildJdk1.6.sh>
+ echo export JAVA_HOME=/opt/jdk1.6.0_10
+ echo export PATH=$JAVA_HOME/bin:$PATH
+ echo /opt/ant1.7/bin/ant compile.java
+ chmod a+x <http://ci.pentaho.com/job/mondrian-3.2/ws/buildJdk1.6.sh>
[workspace] $ /opt/ant1.7/bin/ant -Divy.repository.id=pentaho -Divy.repository.publish=${PENTAHO_OPEN_REPO} -Dunix.script=/build/hudson/jobs/mondrian/workspace/buildJdk1.6.sh clean-deep binzip workbench-dist publish
Buildfile: build.xml

clean-deep:

clean:

version:

checkIsNotJdk16:

antcontrib.download-check:

antcontrib.download:

install-antcontrib:

ivy.download-check:

ivy.download:

install-ivy:
     [echo] Installing IVY...

resolve:
     [echo] symlink=true
[ivy:resolve] :: Ivy 2.1.0 - 20090925235825 :: http://ant.apache.org/ivy/ ::
[ivy:resolve] :: loading settings :: url = <http://ci.pentaho.com/job/mondrian-3.2/ws/ivysettings.xml>
[ivy:resolve] :: resolving dependencies :: pentaho#mondrian-workbench;3.2-SNAPSHOT
[ivy:resolve] 	confs: [default]
[ivy:resolve] 	found commons-codec#commons-codec;1.2 in public
[ivy:resolve] 	found commons-httpclient#commons-httpclient;3.0.1 in public
[ivy:resolve] 	found commons-logging#commons-logging;1.0.3 in public
[ivy:resolve] 	found commons-lang#commons-lang;2.3 in ibiblio
[ivy:resolve] 	found commons-io#commons-io;1.3.2 in ibiblio
[ivy:resolve] 	found jaxen#jaxen;1.1.1 in public
[ivy:resolve] 	found dom4j#dom4j;1.6.1 in public
[ivy:resolve] 	found msv#xsdlib;20030807 in ibiblio
[ivy:resolve] 	found msv#relaxngDatatype;20030807 in public
[ivy:resolve] 	found pull-parser#pull-parser;2 in ibiblio
[ivy:resolve] 	found xpp3#xpp3;1.1.3.3 in ibiblio
[ivy:resolve] 	found stax#stax-api;1.0 in public
[ivy:resolve] 	found xml-apis#xml-apis;1.3.02 in public
[ivy:resolve] 	found jdom#jdom;1.0 in public
[ivy:resolve] 	found xom#xom;1.0 in public
[ivy:resolve] 	found xerces#xmlParserAPIs;2.6.2 in public
[ivy:resolve] 	found xalan#xalan;2.6.0 in public
[ivy:resolve] 	found com.ibm.icu#icu4j;2.6.1 in ibiblio
[ivy:resolve] 	found junit#junit;4.0 in ibiblio
[ivy:resolve] 	found pentaho#pentaho-mondrianschemaworkbench-plugins;1.0.42455 in pentaho-rep
[ivy:resolve] 	found pentaho#pentaho-xul-core;TRUNK-SNAPSHOT in pentaho-rep
[ivy:resolve] 	found pentaho#pentaho-xul-swing;TRUNK-SNAPSHOT in pentaho-rep
[ivy:resolve] 	found commons-beanutils#commons-beanutils;1.6 in public
[ivy:resolve] 	found org.codehaus.groovy#groovy-all;1.5.6 in public
[ivy:resolve] 	found pentaho#pentaho-database;TRUNK-SNAPSHOT in pentaho-rep
[ivy:resolve] 	found pentaho.kettle#kettle-core;TRUNK-SNAPSHOT in pentaho-rep
[ivy:resolve] 	found pentaho.kettle#kettle-db;TRUNK-SNAPSHOT in pentaho-rep
[ivy:resolve] 	found pentaho.kettle#kettle-engine;TRUNK-SNAPSHOT in pentaho-rep
[ivy:resolve] 	found xerces#xercesImpl;2.9.1 in public
[ivy:resolve] 	found xml-apis#xml-apis;1.3.04 in public
[ivy:resolve] 	found xml-resolver#xml-resolver;1.2 in ibiblio
[ivy:resolve] downloading http://repo1.maven.org/maven2/com/ibm/icu/icu4j/2.6.1/icu4j-2.6.1.jar ...
[ivy:resolve] ......................................................................................................................................................................................................................................................................................................................................................................................................................................
[ivy:resolve] .............................................................................................................................................................................................................................................................................................................................................................................................................................................................................................................................................................................................................................................................................
[ivy:resolve] ................................................................................................................................................................................................................................................................................................................................................................................................................................................................................................................................................................................................... (2393kB)
[ivy:resolve] .. (0kB)
[ivy:resolve] :: resolution report :: resolve 32348ms :: artifacts dl 7036ms
[ivy:resolve] 	:: evicted modules:
[ivy:resolve] 	junit#junit;3.8.1 by [junit#junit;4.0] in [default]
[ivy:resolve] 	xml-apis#xml-apis;1.0.b2 by [xml-apis#xml-apis;1.3.02] in [default]
[ivy:resolve] 	jaxen#jaxen;1.1-beta-6 by [jaxen#jaxen;1.1.1] in [default]
[ivy:resolve] 	xml-apis#xml-apis;1.3.02 by [xml-apis#xml-apis;1.3.04] in [default]
[ivy:resolve] 	xerces#xercesImpl;2.6.2 by [xerces#xercesImpl;2.9.1] in [default]
[ivy:resolve] 	xml-apis#xml-apis;2.0.2 by [xml-apis#xml-apis;1.3.02] in [default]
	---------------------------------------------------------------------
	|                  |            modules            ||   artifacts   |
	|       conf       | number| search|dwnlded|evicted|| number|dwnlded|
	---------------------------------------------------------------------
	|      default     |   36  |   6   |   0   |   6   ||   40  |   0   |
	---------------------------------------------------------------------
[ivy:resolve] 
[ivy:resolve] :: problems summary ::
[ivy:resolve] :::: WARNINGS
[ivy:resolve] 		[FAILED     ] com.ibm.icu#icu4j;2.6.1!icu4j.jar: /home/tomcat/.ivy2/cache/com.ibm.icu/icu4j/jars/icu4j-2.6.1.jar.part (No such file or directory) (6792ms)
[ivy:resolve] 
[ivy:resolve] :: USE VERBOSE OR DEBUG MESSAGE LEVEL FOR MORE DETAILS
[ivy:retrieve] :: retrieving :: pentaho#mondrian-workbench
[ivy:retrieve] 	confs: [default]
[ivy:retrieve] 	28 artifacts copied, 1 already retrieved (16846kB/2110ms)
[ivy:retrieve] :: retrieving :: pentaho#mondrian-workbench
[ivy:retrieve] 	confs: [default]
[ivy:retrieve] 	11 artifacts copied, 0 already retrieved (6419kB/1006ms)
[ivy:resolve] :: resolving dependencies :: pentaho#mondrian;3.2-SNAPSHOT
[ivy:resolve] 	confs: [codegen, default, default-jdk1.4, sources, dist, test]
[ivy:resolve] 	found commons-collections#commons-collections;3.2 in public
[ivy:resolve] 	found commons-dbcp#commons-dbcp;1.2 in public
[ivy:resolve] 	found commons-pool#commons-pool;1.2 in public
[ivy:resolve] 	found xerces#xerces;2.0.2 in public
[ivy:resolve] 	found commons-lang#commons-lang;2.0 in public
[ivy:resolve] 	found commons-io#commons-io;1.3.1 in public
[ivy:resolve] 	found commons-logging#commons-logging;1.0.4 in public
[ivy:resolve] 	found commons-math#commons-math;1.0 in public
[ivy:resolve] 	found commons-vfs#commons-vfs;1.0 in public
[ivy:resolve] 	found javacup#javacup;10k in default
[ivy:resolve] 	found net.java.dev.javacc#javacc;5.0 in public
[ivy:resolve] 	found dom4j#dom4j;1.6.1 in public
[ivy:resolve] 	found eigenbase#eigenbase-xom;1.3.0.13768 in default
[ivy:resolve] 	found eigenbase#eigenbase-properties;1.1.0.10924 in default
[ivy:resolve] 	found eigenbase#eigenbase-resgen;1.3.0.13768 in default
[ivy:resolve] 	found sun#jlfgr;1.0 in default
[ivy:resolve] 	found javax.servlet#jsp-api;2.0 in public
[ivy:resolve] 	found javax.servlet#servlet-api;2.4 in public
[ivy:resolve] 	found log4j#log4j;1.2.9 in public
[ivy:resolve] 	found org.olap4j#olap4j;0.9.9.393 in pentaho-rep
[ivy:resolve] 	found org.olap4j#olap4j-tck;0.9.9.393 in pentaho-rep
[ivy:resolve] 	found xalan#xalan;2.4.1 in public
[ivy:resolve] 	found xerces#xercesImpl;2.5.0 in ibiblio
[ivy:resolve] 	found backport-util-concurrent#backport-util-concurrent;3.1 in public
[ivy:resolve] 	found asm#asm;3.1 in public
[ivy:resolve] 	found asm#asm-commons;3.1 in ibiblio
[ivy:resolve] 	found asm#asm-tree;3.1 in public
[ivy:resolve] 	found asm#asm-util;3.1 in ibiblio
[ivy:resolve] 	found retroweaver#retroweaver;2.0.7 in pentaho-rep
[ivy:resolve] 	found retroweaver#retroweaver-rt;2.0.7 in pentaho-rep
[ivy:resolve] 	found org.apache.derby#derby;10.2.2.0 in ibiblio
[ivy:resolve] 	found hsqldb#hsqldb;1.8.0 in default
[ivy:resolve] 	found com.tonbeller#jpivot;1.8.0-100420 in default
[ivy:resolve] 	found junit#junit;3.8.1 in public
[ivy:resolve] 	found xmlunit#xmlunit;1.1 in ibiblio
[ivy:resolve] downloading http://repo1.maven.org/maven2/commons-lang/commons-lang/2.0/commons-lang-2.0.jar ...
[ivy:resolve] ......................................................................................................................... (165kB)
[ivy:resolve] .. (0kB)
[ivy:resolve] 	[SUCCESSFUL ] commons-lang#commons-lang;2.0!commons-lang.jar (3245ms)
[ivy:resolve] downloading http://repo1.maven.org/maven2/log4j/log4j/1.2.9/log4j-1.2.9.jar ...
[ivy:resolve] ......................................................................................................................................................................................................................................................... (344kB)
[ivy:resolve] .. (0kB)
[ivy:resolve] downloading http://repo1.maven.org/maven2/log4j/log4j/1.2.9/log4j-1.2.9.jar ...
[ivy:resolve] .................................................................................................................................................................................................................................................................. (344kB)
[ivy:resolve] .. (0kB)
[ivy:resolve] 	[SUCCESSFUL ] log4j#log4j;1.2.9!log4j.jar (2864ms)
[ivy:resolve] downloading http://repo.pentaho.org/artifactory/repo/org/olap4j/olap4j/0.9.9.393/olap4j-0.9.9.393.jar ...
[ivy:resolve] ......... (445kB)
[ivy:resolve] .. (0kB)
[ivy:resolve] downloading http://repo1.maven.org/maven2/xerces/xercesImpl/2.5.0/xercesImpl-2.5.0.jar ...
[ivy:resolve] ............................................................................................................................................................................................................................................................................................................................................................................................................................................................................................................................................................................................................................................. (905kB)
[ivy:resolve] downloading http://repo1.maven.org/maven2/asm/asm-commons/3.1/asm-commons-3.1.jar ...
[ivy:resolve] ...................... (31kB)
[ivy:resolve] downloading http://repo1.maven.org/maven2/asm/asm-commons/3.1/asm-commons-3.1.jar ...
[ivy:resolve] ................... (31kB)
[ivy:resolve] .. (0kB)
[ivy:resolve] downloading http://repo1.maven.org/maven2/asm/asm-util/3.1/asm-util-3.1.jar ...
[ivy:resolve] ................... (33kB)
[ivy:resolve] .. (0kB)
[ivy:resolve] 	[SUCCESSFUL ] asm#asm-util;3.1!asm-util.jar (3837ms)
[ivy:resolve] downloading http://repo1.maven.org/maven2/asm/asm-tree/3.1/asm-tree-3.1.jar ...
[ivy:resolve] ............... (21kB)
[ivy:resolve] .. (0kB)
[ivy:resolve] downloading http://repo1.maven.org/maven2/org/apache/derby/derby/10.2.2.0/derby-10.2.2.0.jar ...
[ivy:resolve] ...................................................................................................................................................................................................................................................................................................................................................................................................................................................................................................................................................................................................................................
[ivy:resolve] .....................................................................................................................................................................................................................................................................................................................................................................................................................................................................................................................................................................................................................................................................................................
[ivy:resolve] ........................................................................................................................................................................................................................................................................................................................ (2222kB)
[ivy:resolve] .. (0kB)
[ivy:resolve] downloading http://repo.pentaho.org/artifactory/repo/com/tonbeller/jpivot/1.8.0-100420/jpivot-1.8.0-100420.war ...
[ivy:resolve] .............................................................................................................................................................................................................................................................................................................................................................................................................................................................................................................................................................................................................................................................................................................................................................................................................................................................................................................................................................................................................................................................................................................................................................................................................................................................................................................................................................................................................................................................................................................................................................................................................................................................................................................................................................................................................................................................................................................................................................................................................................................................................................................................................................................................................................................................................................................................................................................................................................................................................................................................................................................................................................................................................................................................................................................................................................................................. (47563kB)
[ivy:resolve] .. (0kB)
[ivy:resolve] 	[SUCCESSFUL ] com.tonbeller#jpivot;1.8.0-100420!jpivot.war (4790ms)
[ivy:resolve] downloading http://repo1.maven.org/maven2/xmlunit/xmlunit/1.1/xmlunit-1.1.jar ...
[ivy:resolve] ............................................................ (84kB)
[ivy:resolve] .. (0kB)
[ivy:resolve] 	[SUCCESSFUL ] xmlunit#xmlunit;1.1!xmlunit.jar (1954ms)
[ivy:resolve] :: resolution report :: resolve 54572ms :: artifacts dl 36626ms
[ivy:resolve] 	:: evicted modules:
[ivy:resolve] 	commons-collections#commons-collections;2.1 by [commons-collections#commons-collections;3.2] in [default]
[ivy:resolve] 	xerces#xercesImpl;2.0.2 by [xerces#xercesImpl;2.5.0] in [default]
[ivy:resolve] 	commons-logging#commons-logging;1.0.3 by [commons-logging#commons-logging;1.0.4] in [default]
	---------------------------------------------------------------------
	|                  |            modules            ||   artifacts   |
	|       conf       | number| search|dwnlded|evicted|| number|dwnlded|
	---------------------------------------------------------------------
	|      codegen     |   0   |   0   |   0   |   0   ||   0   |   0   |
	|      default     |   26  |   4   |   2   |   3   ||   22  |   2   |
	|  default-jdk1.4  |   7   |   3   |   2   |   0   ||   7   |   1   |
	|      sources     |   1   |   1   |   0   |   0   ||   1   |   0   |
	|       dist       |   3   |   1   |   1   |   0   ||   3   |   1   |
	|       test       |   2   |   1   |   1   |   0   ||   2   |   1   |
	---------------------------------------------------------------------
[ivy:resolve] 
[ivy:resolve] :: problems summary ::
[ivy:resolve] :::: WARNINGS
[ivy:resolve] 	problem while downloading module descriptor: http://repo1.maven.org/maven2/log4j/log4j/1.2.9/log4j-1.2.9.pom: /home/tomcat/.ivy2/cache/log4j/log4j/ivy-1.2.9.xml.original.part (No such file or directory) (2739ms)
[ivy:resolve] 	problem while downloading module descriptor: http://repo1.maven.org/maven2/asm/asm-tree/3.1/asm-tree-3.1.pom: /home/tomcat/.ivy2/cache/asm/asm-tree/ivy-3.1.xml.original.part (No such file or directory) (1729ms)
[ivy:resolve] 	impossible to put metadata file in cache: http://repo1.maven.org/maven2/org/apache/derby/derby/10.2.2.0/derby-10.2.2.0.pom (10.2.2.0). java.io.FileNotFoundException: /home/tomcat/.ivy2/cache/org.apache.derby/derby/ivy-10.2.2.0.xml.original (No such file or directory)
[ivy:resolve] 	impossible to put metadata file in cache: http://repo1.maven.org/maven2/xmlunit/xmlunit/1.1/xmlunit-1.1.pom (1.1). java.io.FileNotFoundException: /home/tomcat/.ivy2/cache/xmlunit/xmlunit/ivy-1.1.xml.original (No such file or directory)
[ivy:resolve] 		[FAILED     ] log4j#log4j;1.2.9!log4j.jar: invalid sha1: expected=55856d711ab8b88f8c7b04fd85ff1643ffbfde7c computed=70ac3e65bca07e10426b607ff150003b474d5a37 (2635ms)
[ivy:resolve] 		[FAILED     ] org.olap4j#olap4j;0.9.9.393!olap4j.jar(source): /home/tomcat/.ivy2/cache/org.olap4j/olap4j/sources/olap4j-0.9.9.393-sources.jar.part (No such file or directory) (582ms)
[ivy:resolve] 		[FAILED     ] xerces#xercesImpl;2.5.0!xercesImpl.jar: Downloaded file size doesn't match expected Content Length for http://repo1.maven.org/maven2/xerces/xercesImpl/2.5.0/xercesImpl-2.5.0.jar. Please retry. (2428ms)
[ivy:resolve] 		[FAILED     ] asm#asm-commons;3.1!asm-commons.jar: Downloaded file size doesn't match expected Content Length for http://repo1.maven.org/maven2/asm/asm-commons/3.1/asm-commons-3.1.jar. Please retry. (1849ms)
[ivy:resolve] 		[FAILED     ] asm#asm-commons;3.1!asm-commons.jar: /home/tomcat/.ivy2/cache/asm/asm-commons/jars/asm-commons-3.1.jar.part (No such file or directory) (3803ms)
[ivy:resolve] 		[FAILED     ] asm#asm-commons;3.1!asm-commons.jar:  (0ms)
[ivy:resolve] 	==== pentaho-rep: tried
[ivy:resolve] 	  http://repo.pentaho.org/artifactory/repo/asm/asm-commons/3.1/asm-commons-3.1.jar
[ivy:resolve] 	  http://repo.pentaho.org/artifactory/repo/asm/asm-commons/3.1/asm-commons.jar
[ivy:resolve] 	==== ibiblio: tried
[ivy:resolve] 	  http://repo1.maven.org/maven2/asm/asm-commons/3.1/asm-commons-3.1.jar
[ivy:resolve] 	==== public: tried
[ivy:resolve] 	  http://repo1.maven.org/maven2/asm/asm-commons/3.1/asm-commons-3.1.jar
[ivy:resolve] 		[FAILED     ] asm#asm-tree;3.1!asm-tree.jar: /home/tomcat/.ivy2/cache/asm/asm-tree/jars/asm-tree-3.1.jar.part (No such file or directory) (1892ms)
[ivy:resolve] 		[FAILED     ] org.apache.derby#derby;10.2.2.0!derby.jar: /home/tomcat/.ivy2/cache/org.apache.derby/derby/jars/derby-10.2.2.0.jar.part (No such file or directory) (6512ms)
[ivy:resolve] 		::::::::::::::::::::::::::::::::::::::::::::::
[ivy:resolve] 		::              FAILED DOWNLOADS            ::
[ivy:resolve] 		:: ^ see resolution messages for details  ^ ::
[ivy:resolve] 		::::::::::::::::::::::::::::::::::::::::::::::
[ivy:resolve] 		:: asm#asm-commons;3.1!asm-commons.jar
[ivy:resolve] 		::::::::::::::::::::::::::::::::::::::::::::::
[ivy:resolve] :::: ERRORS
[ivy:resolve] 	unknown resolver pentaho-chained-resolver
[ivy:resolve] 	unknown resolver pentaho-chained-resolver
[ivy:resolve] 	unknown resolver pentaho-mvn
[ivy:resolve] 	unknown resolver pentaho-mvn
[ivy:resolve] 
[ivy:resolve] :: USE VERBOSE OR DEBUG MESSAGE LEVEL FOR MORE DETAILS

BUILD FAILED
<http://ci.pentaho.com/job/mondrian-3.2/ws/build.xml>:369: impossible to resolve dependencies:
	resolve failed - see output for details

Total time: 2 minutes 15 seconds
Archiving artifacts
Recording test results
Recording fingerprints
Skipping Cobertura coverage report as build was not UNSTABLE or better ...




More information about the Mondrian mailing list