[Mondrian] FW: Cron <jhyde at marmalade> nice bash --login /home/jhyde/open2/mondrian/bin/megatest --nightly

Julian Hyde jhyde at pentaho.org
Mon Dec 17 14:26:27 EST 2007


FYI, here's the latest mondrian test output. Some progress on some of the
individual test failures, but one or two of the configurations still have
systemic problems like out-of-memory or NullPointerException. Full log
attached.

Julian

-----Original Message-----
From: Cron Daemon [mailto:root at marmalade.hydromatic.net] 
Sent: Monday, December 17, 2007 1:30 AM
To: julianhyde at gmail.com
Subject: Cron <jhyde at marmalade> nice bash --login
/home/jhyde/open2/mondrian/bin/megatest --nightly

LD_LIBRARY_PATH is:
/home/jhyde/open2/thirdparty/stlport/lib
/home/jhyde/open2/thirdparty/boost/lib
/home/jhyde/open2/aspen/cpp/aspen/farrago/.libs
/home/jhyde/open2/aspen/cpp/aspen/test/.libs
/home/jhyde/open2/aspen/cpp/aspen/libaspen/.libs
/lib
/home/jhyde/open2/fennel/../thirdparty/stlport/lib
/home/jhyde/open2/fennel/../thirdparty/boost/lib
/home/jhyde/open2/fennel/lucidera/farrago/.libs
/home/jhyde/open2/fennel/disruptivetech/farrago/.libs
/home/jhyde/open2/fennel/farrago/.libs
/home/jhyde/open2/fennel/test/.libs
/home/jhyde/open2/fennel/lucidera/libfennel_lu/.libs
/home/jhyde/open2/fennel/disruptivetech/libfennel_dt/.libs
/home/jhyde/open2/fennel/libfennel/.libs
/usr/lib/oracle/xe/app/oracle/product/10.2.0/server/lib
 

... - file(s) up-to-date.
No file(s) to resolve.
At revision 53.

::: Summary :::::::::::::::::::::::::::::::::::::
Tests completed at Mon Dec 17 08:37:48 PST 2007.
Running test with JDK=jdk1.6 retroweave= database=oracle props={}
     [java] OK (1571 tests)
Running test with JDK=jdk1.5 retroweave= database=oracle props={}
     [java] OK (1571 tests)
Running test with JDK=jdk1.5 retroweave= database=derby props={
mondrian.test.VUsers=1}
     [java] OK (1571 tests)
Running test with JDK=jdk1.4 retroweave=true database=mysql props={
mondrian.test.VUsers=1 mondrian.rolap.aggregates.Use=true
mondrian.rolap.aggregates.Read=true}
     [java] 1)
testMultipleDimensionUsages(mondrian.test.SchemaTest)mondrian.olap.MondrianE
xception: Mondrian Error:Too many errors, '1', while loading/reloadin
aggregates.
     [java] 1)
testUnknownUsages(mondrian.test.SchemaTest)junit.framework.ComparisonFailure
: expected:<......> but was:<...06_sales_fact_1997' for fact table
'sales_fact_1997' has a column 'city' with unknown usage.
     [java] 2)
testUnknownUsages1(mondrian.test.SchemaTest)junit.framework.ComparisonFailur
e: expected:<...> but was:<...WARN - Recognizer.checkUnusedColumns:
Candidate aggregate table 'agg_lc_06_sales_fact_1997' for fact table
'sales_fact_1997' has a column 'city' with unknown usage.
     [java] Tests run: 1571,  Failures: 2,  Errors: 1
Running test with JDK=jdk1.5 retroweave= database=mysql props={
mondrian.test.VUsers=1 mondrian.rolap.aggregates.Use=true
mondrian.rolap.aggregates.Read=true}
     [java] 1)
testMultipleDimensionUsages(mondrian.test.SchemaTest)mondrian.olap.MondrianE
xception: Mondrian Error:Too many errors, '1', while loading/reloadin
aggregates.
     [java] 1)
testUnknownUsages(mondrian.test.SchemaTest)junit.framework.ComparisonFailure
: expected:<......> but was:<...06_sales_fact_1997' for fact table
'sales_fact_1997' has a column 'city' with unknown usage.
     [java] 2)
testUnknownUsages1(mondrian.test.SchemaTest)junit.framework.ComparisonFailur
e: expected:<...> but was:<...WARN - Recognizer.checkUnusedColumns:
Candidate aggregate table 'agg_lc_06_sales_fact_1997' for fact table
'sales_fact_1997' has a column 'city' with unknown usage.
     [java] Tests run: 1571,  Failures: 2,  Errors: 1
Running test with JDK=jdk1.4 retroweave=true database=oracle props={
mondrian.test.VUsers=1}
     [java] OK (1571 tests)
Running test with JDK=jdk1.5 retroweave= database=oracle props={
mondrian.test.VUsers=1}
     [java] OK (1571 tests)
Running test with JDK=jdk1.6 retroweave= database=oracle props={
mondrian.test.VUsers=1}
     [java] OK (1571 tests)
Running test with JDK=jdk1.5 retroweave= database=oracle props={
mondrian.test.ExpDependencies=10 mondrian.rolap.evaluate.MaxEvalDepth=6
mondrian.test.random.seed=-1 mondrian.expCache.enable=false}
     [java] 1)
testRollupBottomLevel(mondrian.test.AccessControlTest)mondrian.olap.Mondrian
Exception: Mondrian Error:Internal error: Error while executing query [with
member [Measures].[Foo] as '[Customers].[All Customers].[USA].[CA]'
     [java] Tests run: 1571,  Failures: 0,  Errors: 1
Running test with JDK=jdk1.5 retroweave= database=derby props={
mondrian.test.Class=mondrian.rolap.FastBatchingCellReaderTest}
     [java] OK (34 tests)
Running test with JDK=jdk1.5 retroweave= database=mysql props={
mondrian.test.Class=mondrian.rolap.FastBatchingCellReaderTest}
     [java] 1)
warning(junit.framework.TestSuite$1)junit.framework.AssertionFailedError:
Exception in constructor:
testShouldUseGroupingFunctionOnPropertyTrueAndOnSupportedDB
(mondrian.olap.MondrianException: Mondrian Error:Internal error: Error while
creating SQL dialect
     [java] 2)
warning(junit.framework.TestSuite$1)junit.framework.AssertionFailedError:
Exception in constructor:
testShouldUseGroupingFunctionOnPropertyTrueAndOnNonSupportedDB
(mondrian.olap.MondrianException: Mondrian Error:Internal error: Error while
creating SQL dialect
     [java] 3)
warning(junit.framework.TestSuite$1)junit.framework.AssertionFailedError:
Exception in constructor:
testShouldUseGroupingFunctionOnPropertyFalseOnSupportedDB
(mondrian.olap.MondrianException: Mondrian Error:Internal error: Error while
creating SQL dialect
     [java] 4)
warning(junit.framework.TestSuite$1)junit.framework.AssertionFailedError:
Exception in constructor:
testShouldUseGroupingFunctionOnPropertyFalseOnNonSupportedDB
(mondrian.olap.MondrianException: Mondrian Error:Internal error: Error while
creating SQL dialect
     [java] 5)
warning(junit.framework.TestSuite$1)junit.framework.AssertionFailedError:
Exception in constructor: testDoesDBSupportGroupingSets
(mondrian.olap.MondrianException: Mondrian Error:Internal error: Error while
creating SQL dialect
     [java] 6)
warning(junit.framework.TestSuite$1)junit.framework.AssertionFailedError:
Exception in constructor: testGroupBatchesForNonGroupableBatchesWithSorting
(mondrian.olap.MondrianException: Mondrian Error:Internal error: Error while
creating SQL dialect
     [java] 7)
warning(junit.framework.TestSuite$1)junit.framework.AssertionFailedError:
Exception in constructor:
testGroupBatchesForNonGroupableBatchesWithConstraints
(mondrian.olap.MondrianException: Mondrian Error:Internal error: Error while
creating SQL dialect
     [java] 8)
warning(junit.framework.TestSuite$1)junit.framework.AssertionFailedError:
Exception in constructor: testGroupBatchesForGroupableBatches
(mondrian.olap.MondrianException: Mondrian Error:Internal error: Error while
creating SQL dialect
     [java] 9)
warning(junit.framework.TestSuite$1)junit.framework.AssertionFailedError:
Exception in constructor:
testGroupBatchesForGroupableBatchesAndNonGroupableBatches
(mondrian.olap.MondrianException: Mondrian Error:Internal error: Error while
creating SQL dialect
     [java] 10)
warning(junit.framework.TestSuite$1)junit.framework.AssertionFailedError:
Exception in constructor: testGroupBatchesForTwoSetOfGroupableBatches
(mondrian.olap.MondrianException: Mondrian Error:Internal error: Error while
creating SQL dialect
     [java] 11)
warning(junit.framework.TestSuite$1)junit.framework.AssertionFailedError:
Exception in constructor:
testAddToCompositeBatchForBothBatchesNotPartOfCompositeBatch
(mondrian.olap.MondrianException: Mondrian Error:Internal error: Error while
creating SQL dialect
     [java] 12)
warning(junit.framework.TestSuite$1)junit.framework.AssertionFailedError:
Exception in constructor:
testAddToCompositeBatchForDetailedBatchAlreadyPartOfACompositeBatch
(mondrian.olap.MondrianException: Mondrian Error:Internal error: Error while
creating SQL dialect
     [java] 13)
warning(junit.framework.TestSuite$1)junit.framework.AssertionFailedError:
Exception in constructor:
testAddToCompositeBatchForAggregationBatchAlreadyPartOfACompositeBatch
(mondrian.olap.MondrianException: Mondrian Error:Internal error: Error while
creating SQL dialect
     [java] 14)
warning(junit.framework.TestSuite$1)junit.framework.AssertionFailedError:
Exception in constructor:
testAddToCompositeBatchForBothBatchAlreadyPartOfACompositeBatch
(mondrian.olap.MondrianException: Mondrian Error:Internal error: Error while
creating SQL dialect
     [java] 15)
warning(junit.framework.TestSuite$1)junit.framework.AssertionFailedError:
Exception in constructor:
testCanBatchForBatchWithSuperSetOfContraintColumnBitKeyAndAllValuesForAdditi
onalCondition (mondrian.olap.MondrianException: Mondrian Error:Internal
error: Error while creating SQL dialect
     [java] 16)
warning(junit.framework.TestSuite$1)junit.framework.AssertionFailedError:
Exception in constructor: testCanBatchForBatchWithConstraint
(mondrian.olap.MondrianException: Mondrian Error:Internal error: Error while
creating SQL dialect
     [java] 17)
warning(junit.framework.TestSuite$1)junit.framework.AssertionFailedError:
Exception in constructor: testCanBatchForBatchWithConstraint2
(mondrian.olap.MondrianException: Mondrian Error:Internal error: Error while
creating SQL dialect
     [java] 18)
warning(junit.framework.TestSuite$1)junit.framework.AssertionFailedError:
Exception in constructor:
testCanBatchForBatchWithDistinctCountInDetailedBatch
(mondrian.olap.MondrianException: Mondrian Error:Internal error: Error while
creating SQL dialect
     [java] 19)
warning(junit.framework.TestSuite$1)junit.framework.AssertionFailedError:
Exception in constructor:
testCanBatchForBatchWithDistinctCountInAggregateBatch
(mondrian.olap.MondrianException: Mondrian Error:Internal error: Error while
creating SQL dialect
     [java] 20)
warning(junit.framework.TestSuite$1)junit.framework.AssertionFailedError:
Exception in constructor:
testCanBatchForBatchWithNonSuperSetOfContraintColumnBitKeyAndAllValuesForAdd
itionalCondition (mondrian.olap.MondrianException: Mondrian Error:Internal
error: Error while creating SQL dialect
     [java] 21)
warning(junit.framework.TestSuite$1)junit.framework.AssertionFailedError:
Exception in constructor:
testCanBatchForBatchWithSuperSetOfContraintColumnBitKeyAndNOTAllValuesForAdd
itionalCondition (mondrian.olap.MondrianException: Mondrian Error:Internal
error: Error while creating SQL dialect
     [java] 22)
warning(junit.framework.TestSuite$1)junit.framework.AssertionFailedError:
Exception in constructor:
testCanBatchForBatchesFromSameAggregationButDifferentRollupOption
(mondrian.olap.MondrianException: Mondrian Error:Internal error: Error while
creating SQL dialect
     [java] 23)
warning(junit.framework.TestSuite$1)junit.framework.AssertionFailedError:
Exception in constructor:
testCanBatchForBatchWithSuperSetOfContraintColumnBitKeyAndDifferentValuesFor
OverlappingColumns (mondrian.olap.MondrianException: Mondrian Error:Internal
error: Error while creating SQL dialect
     [java] 24)
warning(junit.framework.TestSuite$1)junit.framework.AssertionFailedError:
Exception in constructor: testCanBatchForBatchWithDifferentAggregationTable
(mondrian.olap.MondrianException: Mondrian Error:Internal error: Error while
creating SQL dialect
     [java] 25)
warning(junit.framework.TestSuite$1)junit.framework.AssertionFailedError:
Exception in constructor: testCompositeBatchLoadAggregation
(mondrian.olap.MondrianException: Mondrian Error:Internal error: Error while
creating SQL dialect
     [java] 26)
warning(junit.framework.TestSuite$1)junit.framework.AssertionFailedError:
Exception in constructor: testLoadDistinctSqlMeasure
(mondrian.olap.MondrianException: Mondrian Error:Internal error: Error while
creating SQL dialect
     [java] 27)
warning(junit.framework.TestSuite$1)junit.framework.AssertionFailedError:
Exception in constructor: testAggregateDistinctCount
(mondrian.olap.MondrianException: Mondrian Error:Internal error: Error while
creating SQL dialect
     [java] 28)
warning(junit.framework.TestSuite$1)junit.framework.AssertionFailedError:
Exception in constructor: testAggregateDistinctCount2
(mondrian.olap.MondrianException: Mondrian Error:Internal error: Error while
creating SQL dialect
     [java] 29)
warning(junit.framework.TestSuite$1)junit.framework.AssertionFailedError:
Exception in constructor: testAggregateDistinctCount3
(mondrian.olap.MondrianException: Mondrian Error:Internal error: Error while
creating SQL dialect
     [java] 30)
warning(junit.framework.TestSuite$1)junit.framework.AssertionFailedError:
Exception in constructor: testAggregateDistinctCount4
(mondrian.olap.MondrianException: Mondrian Error:Internal error: Error while
creating SQL dialect
     [java] 31)
warning(junit.framework.TestSuite$1)junit.framework.AssertionFailedError:
Exception in constructor: testAggregateDistinctCount5
(mondrian.olap.MondrianException: Mondrian Error:Internal error: Error while
creating SQL dialect
     [java] 32)
warning(junit.framework.TestSuite$1)junit.framework.AssertionFailedError:
Exception in constructor: testDistinctCountBug1785406
(mondrian.olap.MondrianException: Mondrian Error:Internal error: Error while
creating SQL dialect
     [java] 33)
warning(junit.framework.TestSuite$1)junit.framework.AssertionFailedError:
Exception in constructor: testDistinctCountBug1785406_2
(mondrian.olap.MondrianException: Mondrian Error:Internal error: Error while
creating SQL dialect
     [java] 34)
warning(junit.framework.TestSuite$1)junit.framework.AssertionFailedError:
Exception in constructor: testAggregateDistinctCountInDimensionFilter
(mondrian.olap.MondrianException: Mondrian Error:Internal error: Error while
creating SQL dialect
     [java] Tests run: 34,  Failures: 34,  Errors: 0
Running test with JDK=jdk1.5 retroweave= database=oracle props={
mondrian.rolap.aggregates.Use=true mondrian.rolap.aggregates.Read=true}
     [java] 1)
testMultipleDimensionUsages(mondrian.test.SchemaTest)mondrian.olap.MondrianE
xception: Mondrian Error:Too many errors, '1', while loading/reloadin
aggregates.
     [java] 1)
testUnknownUsages(mondrian.test.SchemaTest)junit.framework.ComparisonFailure
: expected:<......> but was:<...06_sales_fact_1997' for fact table
'sales_fact_1997' has a column 'city' with unknown usage.
     [java] 2)
testUnknownUsages1(mondrian.test.SchemaTest)junit.framework.ComparisonFailur
e: expected:<...> but was:<...WARN - Recognizer.checkUnusedColumns:
Candidate aggregate table 'agg_lc_06_sales_fact_1997' for fact table
'sales_fact_1997' has a column 'city' with unknown usage.
     [java] Tests run: 1571,  Failures: 2,  Errors: 1
Running test with JDK=jdk1.5 retroweave= database=oracle props={
mondrian.olap.case.sensitive=false}
     [java] OK (1571 tests)
Running test with JDK=jdk1.6 retroweave= database=mysql props={
mondrian.test.ExpDependencies=10 mondrian.rolap.evaluate.MaxEvalDepth=6
mondrian.rolap.star.disableCaching=true
mondrian.xmla.drillthroughTotalCount.enable=false
mondrian.rolap.SparseSegmentValueThreshold=25000
mondrian.rolap.groupingsets.enable=true
mondrian.olap.NullMemberRepresentation=TheNullMember}
     [java] 1)
testRollupPolicySimultaneous(mondrian.test.AccessControlTest)mondrian.olap.M
ondrianException: Mondrian Error:Internal error: Error while executing query
[with member [Measures].[Foo] as '[Measures].[Unit Sales]'
     [java] 2)
testTotalingForValidAndNonValidMeasuresWithJoiningDimensions(mondrian.test.I
gnoreUnrelatedDimensionsTest)java.lang.OutOfMemoryError: Java heap space
     [java] 3)
testCalcMemberWithNonEmptyCrossJoin(mondrian.rolap.NonEmptyTest)java.lang.Ou
tOfMemoryError: Java heap space
     [java] 4)
testLevelMembersWithoutNonEmpty(mondrian.rolap.NonEmptyTest)java.lang.OutOfM
emoryError: Java heap space
     [java] 5)
testDimensionMembers(mondrian.rolap.NonEmptyTest)mondrian.olap.ResourceLimit
ExceededException: Mondrian Error:Number of members to be read exceeded
limit (34)
     [java] 6)
testMemberChildrenOfRolapMember(mondrian.rolap.NonEmptyTest)mondrian.olap.Re
sourceLimitExceededException: Mondrian Error:Number of members to be read
exceeded limit (50)
     [java] 7)
testMemberChildrenNoWhere(mondrian.rolap.NonEmptyTest)mondrian.olap.Resource
LimitExceededException: Mondrian Error:Number of members to be read exceeded
limit (50)
     [java] Tests run: 1571,  Failures: 0,  Errors: 7
Running test with JDK=jdk1.5 retroweave= database=oracle props={
mondrian.test.ExpDependencies=10 mondrian.rolap.evaluate.MaxEvalDepth=6
mondrian.test.random.seed=-1 mondrian.expCache.enable=false}
     [java] 1)
testRollupBottomLevel(mondrian.test.AccessControlTest)mondrian.olap.Mondrian
Exception: Mondrian Error:Internal error: Error while executing query [with
member [Measures].[Foo] as '[Customers].[All Customers].[USA].[CA]'
     [java] Tests run: 1571,  Failures: 0,  Errors: 1
Running test with JDK=jdk1.5 retroweave= database=oracle props={
mondrian.test.ExpDependencies=100 mondrian.rolap.evaluate.MaxEvalDepth=6
mondrian.test.random.seed=15583 mondrian.expCache.enable=false}
     [java] 1)
testRollupBottomLevel(mondrian.test.AccessControlTest)mondrian.olap.Mondrian
Exception: Mondrian Error:Internal error: Error while executing query [with
member [Measures].[Foo] as '[Customers].[All Customers].[USA]'
     [java] 2)
testRollupPolicySimultaneous(mondrian.test.AccessControlTest)mondrian.olap.M
ondrianException: Mondrian Error:Internal error: Error while executing query
[with member [Measures].[Foo] as '[Measures].[Unit Sales]'
     [java] Tests run: 1571,  Failures: 0,  Errors: 2
Running test with JDK=jdk1.5 retroweave= database=oracle props={
mondrian.expCache.enable=false}
     [java] OK (1571 tests)
Running test with JDK=jdk1.5 retroweave= database=oracle props={
mondrian.rolap.aggregates.Use=true mondrian.rolap.aggregates.Read=true}
     [java] 1)
testMultipleDimensionUsages(mondrian.test.SchemaTest)mondrian.olap.MondrianE
xception: Mondrian Error:Too many errors, '1', while loading/reloadin
aggregates.
     [java] 1)
testUnknownUsages(mondrian.test.SchemaTest)junit.framework.ComparisonFailure
: expected:<......> but was:<...06_sales_fact_1997' for fact table
'sales_fact_1997' has a column 'city' with unknown usage.
     [java] 2)
testUnknownUsages1(mondrian.test.SchemaTest)junit.framework.ComparisonFailur
e: expected:<...> but was:<...WARN - Recognizer.checkUnusedColumns:
Candidate aggregate table 'agg_lc_06_sales_fact_1997' for fact table
'sales_fact_1997' has a column 'city' with unknown usage.
     [java] Tests run: 1571,  Failures: 2,  Errors: 1
Running test with JDK=jdk1.5 retroweave= database=oracle props={
mondrian.rolap.star.disableCaching=true}
     [java] 1)
testTotalingForValidAndNonValidMeasuresWithJoiningDimensions(mondrian.test.I
gnoreUnrelatedDimensionsTest)java.lang.OutOfMemoryError: Java heap space
     [java] 2)
testCalcMemberWithNonEmptyCrossJoin(mondrian.rolap.NonEmptyTest)java.lang.Ou
tOfMemoryError: Java heap space
     [java] 3)
testLevelMembersWithoutNonEmpty(mondrian.rolap.NonEmptyTest)java.lang.OutOfM
emoryError: Java heap space
     [java] 4)
testVCNativeCJWithTopPercent(mondrian.rolap.NonEmptyTest)java.lang.OutOfMemo
ryError: Java heap space
     [java] 5)
testVCOrdinalExpression(mondrian.rolap.NonEmptyTest)java.lang.OutOfMemoryErr
or: Java heap space
     [java] 6)
testNonEmptyWithCalcMeasure(mondrian.rolap.NonEmptyTest)java.lang.OutOfMemor
yError: Java heap space
     [java] 7)
testCalculatedSlicerMember(mondrian.rolap.NonEmptyTest)java.lang.OutOfMemory
Error: Java heap space
     [java] Tests run: 1571,  Failures: 0,  Errors: 7
Running test with JDK=jdk1.5 retroweave= database=oracle props={
mondrian.olap.case.sensitive=false}
     [java] OK (1571 tests)
Running test with JDK=jdk1.5 retroweave=true database=oracle props={}
     [java] OK (1571 tests)
Running test with JDK=jdk1.6 retroweave=true database=oracle props={}
     [java] OK (1571 tests)
Running test with JDK=jdk1.6 retroweave= database=mysql props={
mondrian.native.crossjoin.enable=false mondrian.native.topcount.enable=false
mondrian.xmla.drillthroughTotalCount.enable=false
mondrian.rolap.LargeDimensionThreshold=1}
     [java] 1)
testQueryWithIndex(mondrian.rolap.IndexedValuesTest)java.lang.NullPointerExc
eption
     [java] 2)
testPooledConnectionWithProperties(mondrian.rolap.RolapConnectionTest)java.l
ang.NullPointerException
     [java] 3)
testNonPooledConnectionWithProperties(mondrian.rolap.RolapConnectionTest)jav
a.lang.NullPointerException
     [java] 4)
testFormatLocale(mondrian.rolap.RolapConnectionTest)java.lang.NullPointerExc
eption
     [java] 5)
testFormatStringLocale(mondrian.rolap.RolapConnectionTest)java.lang.NullPoin
terException
     [java] 6)
testAllowsCompoundCountDistinct(mondrian.test.DialectTest)java.lang.NullPoin
terException
     [java] 7)
testAllowsCountDistinct(mondrian.test.DialectTest)java.lang.NullPointerExcep
tion
     [java] 8)
testAllowsMultipleCountDistinct(mondrian.test.DialectTest)java.lang.NullPoin
terException
     [java] 9)
testAllowsDdl(mondrian.test.DialectTest)java.lang.NullPointerException
     [java] 10)
testAllowsFromQuery(mondrian.test.DialectTest)java.lang.NullPointerException
     [java] 11)
testRequiresFromQueryAlias(mondrian.test.DialectTest)java.lang.NullPointerEx
ception
     [java] 12)
testRequiresOrderByAlias(mondrian.test.DialectTest)java.lang.NullPointerExce
ption
     [java] 13)
testAllowsOrderByAlias(mondrian.test.DialectTest)java.lang.NullPointerExcept
ion
     [java] 14)
testSupportsGroupByExpressions(mondrian.test.DialectTest)java.lang.NullPoint
erException
     [java] 15)
testAllowsGroupingSets(mondrian.test.DialectTest)java.lang.NullPointerExcept
ion
     [java] 16)
testSupportsMultiValueInExpr(mondrian.test.DialectTest)java.lang.NullPointer
Exception
     [java] 17)
testResultSetConcurrency(mondrian.test.DialectTest)java.lang.NullPointerExce
ption
     [java] 18)
queryTest_171868b15cbf2ca.xml(mondrian.test.comp.ResultComparatorTest)java.l
ang.NullPointerException
     [java] 19)
queryTest_29ce2f3512f79d38_TOPCOUNT.xml(mondrian.test.comp.ResultComparatorT
est)java.lang.NullPointerException
     [java] 20)
queryTest_c1eef8cf112b8551_TOPCOUNT.xml(mondrian.test.comp.ResultComparatorT
est)java.lang.NullPointerException
     [java] 21)
queryTest_1d839e2be3c177c0.xml(mondrian.test.comp.ResultComparatorTest)java.
lang.NullPointerException
     [java] 22)
queryTest_df48f9ad2ee74746.xml(mondrian.test.comp.ResultComparatorTest)java.
lang.NullPointerException
     [java] 23)
queryTest_c31ffc2bfb11f8.xml(mondrian.test.comp.ResultComparatorTest)java.la
ng.NullPointerException
     [java] 24)
queryTest_72fbd5b8f2963a70_order.xml(mondrian.test.comp.ResultComparatorTest
)java.lang.NullPointerException
     [java] 25)
queryTest_90a4cab10da5631.xml(mondrian.test.comp.ResultComparatorTest)java.l
ang.NullPointerException
     [java] 26)
queryTest_ccf74490de18e83b.xml(mondrian.test.comp.ResultComparatorTest)java.
lang.NullPointerException
     [java] 27)
queryTest_db6ae843fa6d13.xml(mondrian.test.comp.ResultComparatorTest)java.la
ng.NullPointerException
     [java] 28)
queryTest_45f76a3fb635a121.xml(mondrian.test.comp.ResultComparatorTest)java.
lang.NullPointerException
     [java] 29)
queryTest_count_5feb8c38ff9cc1f4.xml(mondrian.test.comp.ResultComparatorTest
)java.lang.NullPointerException
     [java] 30)
queryTest_8db2ece1a44277c0_DefaultMember.xml(mondrian.test.comp.ResultCompar
atorTest)java.lang.NullPointerException
     [java] 31)
queryTest_d5e930177e10b317.xml(mondrian.test.comp.ResultComparatorTest)java.
lang.NullPointerException
     [java] 32)
queryTest_2bf0d41b85d47f2.xml(mondrian.test.comp.ResultComparatorTest)java.l
ang.NullPointerException
     [java] 33)
queryTest_nextMember_6be65816fbe41c36.xml(mondrian.test.comp.ResultComparato
rTest)java.lang.NullPointerException
     [java] 34)
queryTest_9d7658e66b8d1053.xml(mondrian.test.comp.ResultComparatorTest)java.
lang.NullPointerException
     [java] 35)
queryTest_lastChild_4c923cd7431fde9.xml(mondrian.test.comp.ResultComparatorT
est)java.lang.NullPointerException
     [java] 36)
queryTest_1662791d39c739_cj_modified.xml(mondrian.test.comp.ResultComparator
Test)java.lang.NullPointerException
     [java] 37)
queryTest_b449ddf3544271b.xml(mondrian.test.comp.ResultComparatorTest)java.l
ang.NullPointerException
     [java] 38)
queryTest_count_3f4d6a85fe60af51.xml(mondrian.test.comp.ResultComparatorTest
)java.lang.NullPointerException
     [java] 39)
queryTest_3ced6f4514a88a80.xml(mondrian.test.comp.ResultComparatorTest)java.
lang.NullPointerException
     [java] 40)
queryTest_fdd8ec9d9e44ef9e.xml(mondrian.test.comp.ResultComparatorTest)java.
lang.NullPointerException
     [java] 41)
queryTest_4e509257ee5d860_CLOSINGPERIOD.xml(mondrian.test.comp.ResultCompara
torTest)java.lang.NullPointerException
     [java] 42)
queryTest_5533c6a5409b9e11.xml(mondrian.test.comp.ResultComparatorTest)java.
lang.NullPointerException
     [java] 43)
queryTest_590b8a75073c2fd.xml(mondrian.test.comp.ResultComparatorTest)java.l
ang.NullPointerException
     [java] 44)
queryTest_8e89a6f2907e4bfa.xml(mondrian.test.comp.ResultComparatorTest)java.
lang.NullPointerException
     [java] 45)
queryTest_6d93c92e9f1b2588_FirstSibling.xml(mondrian.test.comp.ResultCompara
torTest)java.lang.NullPointerException
     [java] 46)
queryTest_a8c58f52ffec61eb.xml(mondrian.test.comp.ResultComparatorTest)java.
lang.NullPointerException
     [java] 47)
queryTest_25e9b258b27b8e5f_UNION.xml(mondrian.test.comp.ResultComparatorTest
)java.lang.NullPointerException
     [java] 48)
queryTest_6394d1ade51cd2e1.xml(mondrian.test.comp.ResultComparatorTest)java.
lang.NullPointerException
     [java] 49)
queryTest_1dd7b1c0801411f1.xml(mondrian.test.comp.ResultComparatorTest)java.
lang.NullPointerException
     [java] 50)
queryTest_ce24f4e185724fcf.xml(mondrian.test.comp.ResultComparatorTest)java.
lang.NullPointerException
     [java] 51)
queryTest_ae6c5380f5688f9a.xml(mondrian.test.comp.ResultComparatorTest)java.
lang.NullPointerException
     [java] 52)
queryTest_head_906ddf80348759aa.xml(mondrian.test.comp.ResultComparatorTest)
java.lang.NullPointerException
     [java] 53)
queryTest_6869259e81243129_UniqueName.xml(mondrian.test.comp.ResultComparato
rTest)java.lang.NullPointerException
     [java] 54)
queryTest_count_4369921d56b9648c.xml(mondrian.test.comp.ResultComparatorTest
)java.lang.NullPointerException
     [java] 55)
queryTest_16d5817036cb9af9_QTD.xml(mondrian.test.comp.ResultComparatorTest)j
ava.lang.NullPointerException
     [java] 56)
queryTest_86e3b6eb3551af2_Name.xml(mondrian.test.comp.ResultComparatorTest)j
ava.lang.NullPointerException
     [java] 57)
queryTest_lastSibling_4534b3d703f05.xml(mondrian.test.comp.ResultComparatorT
est)java.lang.NullPointerException
     [java] 58)
queryTest_d236c4a6be90a755_Name.xml(mondrian.test.comp.ResultComparatorTest)
java.lang.NullPointerException
     [java] 59)
queryTest_39a23182cd8ea07a.xml(mondrian.test.comp.ResultComparatorTest)java.
lang.NullPointerException
     [java] 60)
queryTest_a787eda4ece6832b.xml(mondrian.test.comp.ResultComparatorTest)java.
lang.NullPointerException
     [java] 61)
queryTest_9e75d6a51fd5dc8.xml(mondrian.test.comp.ResultComparatorTest)java.l
ang.NullPointerException
     [java] 62)
queryTest_lead_a9edf143dab0885b.xml(mondrian.test.comp.ResultComparatorTest)
java.lang.NullPointerException
     [java] 63)
queryTest_b89b717be8752ffc.xml(mondrian.test.comp.ResultComparatorTest)java.
lang.NullPointerException
     [java] 64)
queryTest_c0d8158f8ff9494.xml(mondrian.test.comp.ResultComparatorTest)java.l
ang.NullPointerException
     [java] 65)
queryTest_80a3cf15a6bb7096.xml(mondrian.test.comp.ResultComparatorTest)java.
lang.NullPointerException
     [java] 66)
queryTest_cd5d651b9ef5da4_Name.xml(mondrian.test.comp.ResultComparatorTest)j
ava.lang.NullPointerException
     [java] 67)
queryTest_916bd786eec352d3.xml(mondrian.test.comp.ResultComparatorTest)java.
lang.NullPointerException
     [java] 68)
queryTest_42d09946aca4654.xml(mondrian.test.comp.ResultComparatorTest)java.l
ang.NullPointerException
     [java] 69)
queryTest_b11de0f13b2a073.xml(mondrian.test.comp.ResultComparatorTest)java.l
ang.NullPointerException
     [java] 70)
queryTest_c59fb9ab5b11f3eb.xml(mondrian.test.comp.ResultComparatorTest)java.
lang.NullPointerException
     [java] 71)
queryTest_lastSibling_69655644a9e6eb5a.xml(mondrian.test.comp.ResultComparat
orTest)java.lang.NullPointerException
     [java] 72)
queryTest_2edf32fe74d61e16.xml(mondrian.test.comp.ResultComparatorTest)java.
lang.NullPointerException
     [java] 73)
queryTest_5155556eee90d3e9.xml(mondrian.test.comp.ResultComparatorTest)java.
lang.NullPointerException
     [java] 74)
queryTest_aggregate_abf4dc9a944e33c5.xml(mondrian.test.comp.ResultComparator
Test)java.lang.NullPointerException
     [java] 75)
queryTest_lastChild_4d2a16e2912f86d2.xml(mondrian.test.comp.ResultComparator
Test)java.lang.NullPointerException
     [java] 76)
queryTest_nextMember_ded093b6819c35f4.xml(mondrian.test.comp.ResultComparato
rTest)java.lang.NullPointerException
     [java] 77)
queryTest_1e5083a85d947_MTD.xml(mondrian.test.comp.ResultComparatorTest)java
.lang.NullPointerException
     [java] 78)
queryTest_19873fb52f747e59.xml(mondrian.test.comp.ResultComparatorTest)java.
lang.NullPointerException
     [java] 79)
queryTest_d5e97dd90c231d0.xml(mondrian.test.comp.ResultComparatorTest)java.l
ang.NullPointerException
     [java] 80)
queryTest_fd20bd8afe4ec683.xml(mondrian.test.comp.ResultComparatorTest)java.
lang.NullPointerException
     [java] 81)
queryTest_1267e0433c5ac33.xml(mondrian.test.comp.ResultComparatorTest)java.l
ang.NullPointerException
     [java] 82)
queryTest_7ccc4cf23a5e748.xml(mondrian.test.comp.ResultComparatorTest)java.l
ang.NullPointerException
     [java] 83)
queryTest_aggregate_ffc012281623093.xml(mondrian.test.comp.ResultComparatorT
est)java.lang.NullPointerException
     [java] 84)
queryTest_acbef2c0a5781654.xml(mondrian.test.comp.ResultComparatorTest)java.
lang.NullPointerException
     [java] 85)
queryTest_bf2581637adb117c.xml(mondrian.test.comp.ResultComparatorTest)java.
lang.NullPointerException
     [java] 86)
queryTest_26e7ec5979bbb15e_order.xml(mondrian.test.comp.ResultComparatorTest
)java.lang.NullPointerException
     [java] 87)
queryTest_22e1ef5ddf2db2f_Subset.xml(mondrian.test.comp.ResultComparatorTest
)java.lang.NullPointerException
     [java] 88)
queryTest_6bb1e348f56d535.xml(mondrian.test.comp.ResultComparatorTest)java.l
ang.NullPointerException
     [java] 89)
queryTest_f7b258919a7869e.xml(mondrian.test.comp.ResultComparatorTest)java.l
ang.NullPointerException
     [java] 90)
queryTest_hierarchize_5ecd8fe83e36425.xml(mondrian.test.comp.ResultComparato
rTest)java.lang.NullPointerException
     [java] 91)
queryTest_lead_fc7c1724ebcd5e32.xml(mondrian.test.comp.ResultComparatorTest)
java.lang.NullPointerException
     [java] 92)
queryTest_df2bac111bbd7fc.xml(mondrian.test.comp.ResultComparatorTest)java.l
ang.NullPointerException
     [java] 93)
queryTest_fdc4dd3983d1c2c.xml(mondrian.test.comp.ResultComparatorTest)java.l
ang.NullPointerException
     [java] 94)
queryTest_6744da12d716d072.xml(mondrian.test.comp.ResultComparatorTest)java.
lang.NullPointerException
     [java] 95)
queryTest_9f61bc83e47eebf3.xml(mondrian.test.comp.ResultComparatorTest)java.
lang.NullPointerException
     [java] 96)
queryTest_4194b1df527ec743.xml(mondrian.test.comp.ResultComparatorTest)java.
lang.NullPointerException
     [java] 97)
queryTest_942cf71cc1e113.xml(mondrian.test.comp.ResultComparatorTest)java.la
ng.NullPointerException
     [java] 98)
queryTest_4a7b5babf69b6ca.xml(mondrian.test.comp.ResultComparatorTest)java.l
ang.NullPointerException
     [java] 99)
queryTest_f365697c46dec3d0.xml(mondrian.test.comp.ResultComparatorTest)java.
lang.NullPointerException
     [java] 100)
queryTest_a9d52afbb4612950.xml(mondrian.test.comp.ResultComparatorTest)java.
lang.NullPointerException
     [java] 101)
queryTest_ce14fddee524718.xml(mondrian.test.comp.ResultComparatorTest)java.l
ang.NullPointerException
     [java] 102)
queryTest_9027755089303df9.xml(mondrian.test.comp.ResultComparatorTest)java.
lang.NullPointerException
     [java] 103)
queryTest_fec838c3f6f1949_TOPPERCENT.xml(mondrian.test.comp.ResultComparator
Test)java.lang.NullPointerException
     [java] 104)
queryTest_correlation_26d03286d4295e97.xml(mondrian.test.comp.ResultComparat
orTest)java.lang.NullPointerException
     [java] 105)
queryTest_6236cbb13278115.xml(mondrian.test.comp.ResultComparatorTest)java.l
ang.NullPointerException
     [java] 106)
queryTest_45523f9f92a6e0.xml(mondrian.test.comp.ResultComparatorTest)java.la
ng.NullPointerException
     [java] 107)
queryTest_5cb1905047f8199a_Cousin.xml(mondrian.test.comp.ResultComparatorTes
t)java.lang.NullPointerException
     [java] 108)
queryTest_64e38db83fa57498.xml(mondrian.test.comp.ResultComparatorTest)java.
lang.NullPointerException
     [java] 109)
queryTest_58e91375c6bbf928.xml(mondrian.test.comp.ResultComparatorTest)java.
lang.NullPointerException
     [java] 110)
queryTest_353e823fecb0474d.xml(mondrian.test.comp.ResultComparatorTest)java.
lang.NullPointerException
     [java] 111)
queryTest_b7ed8378efbb5fce.xml(mondrian.test.comp.ResultComparatorTest)java.
lang.NullPointerException
     [java] 112)
queryTest_members_731f8d9f9244778.xml(mondrian.test.comp.ResultComparatorTes
t)java.lang.NullPointerException
     [java] 113)
queryTest_1662791d39c739.xml(mondrian.test.comp.ResultComparatorTest)java.la
ng.NullPointerException
     [java] 114)
queryTest_f0d427779a61954f.xml(mondrian.test.comp.ResultComparatorTest)java.
lang.NullPointerException
     [java] 115)
queryTest_correlation_49cd2c5bade7a939.xml(mondrian.test.comp.ResultComparat
orTest)java.lang.NullPointerException
     [java] 116)
queryTest_8173fc75888fd39.xml(mondrian.test.comp.ResultComparatorTest)java.l
ang.NullPointerException
     [java] 117)
queryTest_prevMember_29d35e3111636ef1.xml(mondrian.test.comp.ResultComparato
rTest)java.lang.NullPointerException
     [java] 118)
queryTest_f273544cf94f_Name.xml(mondrian.test.comp.ResultComparatorTest)java
.lang.NullPointerException
     [java] 119)
queryTest_9d3580e3e21f8765.xml(mondrian.test.comp.ResultComparatorTest)java.
lang.NullPointerException
     [java] 120)
queryTest_avg_a1c7dadccdca29.xml(mondrian.test.comp.ResultComparatorTest)jav
a.lang.NullPointerException
     [java] 121)
queryTest_b714558e2fc2355.xml(mondrian.test.comp.ResultComparatorTest)java.l
ang.NullPointerException
     [java] 122)
queryTest_b3fa323364166e89.xml(mondrian.test.comp.ResultComparatorTest)java.
lang.NullPointerException
     [java] 123)
queryTest_cf7012a6b58cc568.xml(mondrian.test.comp.ResultComparatorTest)java.
lang.NullPointerException
     [java] 124)
queryTest_33f161ca6d98519_VarianceP.xml(mondrian.test.comp.ResultComparatorT
est)java.lang.NullPointerException
     [java] 125)
queryTest_9b8562c9286bdab.xml(mondrian.test.comp.ResultComparatorTest)java.l
ang.NullPointerException
     [java] 126)
queryTest_ed7649f92d14cd2a_TOPPERCENT.xml(mondrian.test.comp.ResultComparato
rTest)java.lang.NullPointerException
     [java] 127)
queryTest_90d69f293de8181b.xml(mondrian.test.comp.ResultComparatorTest)java.
lang.NullPointerException
     [java] 128)
queryTest_5da65ca7d76cc7f_COALESCEEMPTY.xml(mondrian.test.comp.ResultCompara
torTest)java.lang.NullPointerException
     [java] 129)
queryTest_3572af958f815277.xml(mondrian.test.comp.ResultComparatorTest)java.
lang.NullPointerException
     [java] 130)
queryTest_4e15fa6d6ab1e4.xml(mondrian.test.comp.ResultComparatorTest)java.la
ng.NullPointerException
     [java] 131)
queryTest_942ce548f98a38.xml(mondrian.test.comp.ResultComparatorTest)java.la
ng.NullPointerException
     [java] 132)
queryTest_c93ab8a76f6497cf_CLOSINGPERIOD.xml(mondrian.test.comp.ResultCompar
atorTest)java.lang.NullPointerException
     [java] 133)
queryTest_aggregate_6fa7b8253f3e31c0.xml(mondrian.test.comp.ResultComparator
Test)java.lang.NullPointerException
     [java] 134)
queryTest_head_198f0ceb268aa74.xml(mondrian.test.comp.ResultComparatorTest)j
ava.lang.NullPointerException
     [java] 135)
queryTest_ef4045594615c7c.xml(mondrian.test.comp.ResultComparatorTest)java.l
ang.NullPointerException
     [java] 136)
queryTest_df27cb9d8192570_Variance.xml(mondrian.test.comp.ResultComparatorTe
st)java.lang.NullPointerException
     [java] 137)
queryTest_5baf1b5edc1b3467.xml(mondrian.test.comp.ResultComparatorTest)java.
lang.NullPointerException
     [java] 138)
queryTest_338185fcb9af6edd_Name.xml(mondrian.test.comp.ResultComparatorTest)
java.lang.NullPointerException
     [java] 139)
queryTest_a1e4721945d222b7.xml(mondrian.test.comp.ResultComparatorTest)java.
lang.NullPointerException
     [java] 140)
queryTest_d179da7db6f6c50.xml(mondrian.test.comp.ResultComparatorTest)java.l
ang.NullPointerException
     [java] 141)
queryTest_cbdc267d808b8c95.xml(mondrian.test.comp.ResultComparatorTest)java.
lang.NullPointerException
     [java] 142)
queryTest_1dfd724ee6d136_FIRSTCHILD.xml(mondrian.test.comp.ResultComparatorT
est)java.lang.NullPointerException
     [java] 143)
queryTest_8534dfefe63645.xml(mondrian.test.comp.ResultComparatorTest)java.la
ng.NullPointerException
     [java] 144)
queryTest_3e5c64b7aadcfe4.xml(mondrian.test.comp.ResultComparatorTest)java.l
ang.NullPointerException
     [java] 145)
queryTest_ddea962bb9cb9913_order.xml(mondrian.test.comp.ResultComparatorTest
)java.lang.NullPointerException
     [java] 146)
queryTest_da108686117d1f57.xml(mondrian.test.comp.ResultComparatorTest)java.
lang.NullPointerException
     [java] 147)
queryTest_32bf66a6519ec827_TOPPERCENT.xml(mondrian.test.comp.ResultComparato
rTest)java.lang.NullPointerException
     [java] 148)
queryTest_3ee94f9757fc8698.xml(mondrian.test.comp.ResultComparatorTest)java.
lang.NullPointerException
     [java] 149)
queryTest_70faea62f26eeae.xml(mondrian.test.comp.ResultComparatorTest)java.l
ang.NullPointerException
     [java] 150)
queryTest_96a0ffa3a8ce52f5_GENERATE.xml(mondrian.test.comp.ResultComparatorT
est)java.lang.NullPointerException
     [java] 151)
queryTest_817a2eb71810feed_YTD.xml(mondrian.test.comp.ResultComparatorTest)j
ava.lang.NullPointerException
     [java] 152)
queryTest_b4c19426e7784361.xml(mondrian.test.comp.ResultComparatorTest)java.
lang.NullPointerException
     [java] 153)
queryTest_b8bdcc55995eeda.xml(mondrian.test.comp.ResultComparatorTest)java.l
ang.NullPointerException
     [java] 154)
queryTest_parent_7889182ac3a99824.xml(mondrian.test.comp.ResultComparatorTes
t)java.lang.NullPointerException
     [java] 155)
queryTest_92eff5f17be36b5.xml(mondrian.test.comp.ResultComparatorTest)java.l
ang.NullPointerException
     [java] 156)
queryTest_3ad7c28e574366cf.xml(mondrian.test.comp.ResultComparatorTest)java.
lang.NullPointerException
     [java] 157)
queryTest_e03db2e8d43a9f7.xml(mondrian.test.comp.ResultComparatorTest)java.l
ang.NullPointerException
     [java] 158)
queryTest_6323d67192567b29.xml(mondrian.test.comp.ResultComparatorTest)java.
lang.NullPointerException
     [java] 159)
queryTest_861c32529972e0.xml(mondrian.test.comp.ResultComparatorTest)java.la
ng.NullPointerException
     [java] 160)
queryTest_d8ade6381515fa88.xml(mondrian.test.comp.ResultComparatorTest)java.
lang.NullPointerException
     [java] 161)
queryTest_d04727679fe397.xml(mondrian.test.comp.ResultComparatorTest)java.la
ng.NullPointerException
     [java] 162)
queryTest_bed44a518dce24.xml(mondrian.test.comp.ResultComparatorTest)java.la
ng.NullPointerException
     [java] 163)
queryTest_4ce92fbbc6f86d8.xml(mondrian.test.comp.ResultComparatorTest)java.l
ang.NullPointerException
     [java] 164)
queryTest_6485a19764d2d7bc_PROPERTIES.xml(mondrian.test.comp.ResultComparato
rTest)java.lang.NullPointerException
     [java] 165)
queryTest_avg_bccad92d5f2b37bf.xml(mondrian.test.comp.ResultComparatorTest)j
ava.lang.NullPointerException
     [java] 166)
queryTest_92fa326a61c9fec6.xml(mondrian.test.comp.ResultComparatorTest)java.
lang.NullPointerException
     [java] 167)
queryTest_55bfd7457ec379e3.xml(mondrian.test.comp.ResultComparatorTest)java.
lang.NullPointerException
     [java] 168)
queryTest_count_9697281acf6f69d.xml(mondrian.test.comp.ResultComparatorTest)
java.lang.NullPointerException
     [java] 169)
queryTest_e43623c87d16133b.xml(mondrian.test.comp.ResultComparatorTest)java.
lang.NullPointerException
     [java] 170)
queryTest_4afe41192c8d9e9.xml(mondrian.test.comp.ResultComparatorTest)java.l
ang.NullPointerException
     [java] 171)
queryTest_avg_852d15ef306e7178.xml(mondrian.test.comp.ResultComparatorTest)j
ava.lang.NullPointerException
     [java] 172)
queryTest_c6a5a837b6dd48b5.xml(mondrian.test.comp.ResultComparatorTest)java.
lang.NullPointerException
     [java] 173)
queryTest_6e272f678215815.xml(mondrian.test.comp.ResultComparatorTest)java.l
ang.NullPointerException
     [java] 174)
queryTest_ac6d217d3a16febe.xml(mondrian.test.comp.ResultComparatorTest)java.
lang.NullPointerException
     [java] 175)
queryTest_dc9f80a1a2ce7c2.xml(mondrian.test.comp.ResultComparatorTest)java.l
ang.NullPointerException
     [java] 176)
queryTest_4077b19efab23af0.xml(mondrian.test.comp.ResultComparatorTest)java.
lang.NullPointerException
     [java] 177)
queryTest_fdd91d27376831d1.xml(mondrian.test.comp.ResultComparatorTest)java.
lang.NullPointerException
     [java] 178)
queryTest_6d042ea3df09ad4_Item.xml(mondrian.test.comp.ResultComparatorTest)j
ava.lang.NullPointerException
     [java] 179)
queryTest_0b1c51fc037104c.xml(mondrian.test.comp.ResultComparatorTest)java.l
ang.NullPointerException
     [java] 180)
queryTest_8351bd6ef1cea1ec.xml(mondrian.test.comp.ResultComparatorTest)java.
lang.NullPointerException
     [java] 181)
queryTest_4e509257ee5d860_CURRENTMEMBER.xml(mondrian.test.comp.ResultCompara
torTest)java.lang.NullPointerException
     [java] 182)
queryTest_parent_1e712d6b848e11d.xml(mondrian.test.comp.ResultComparatorTest
)java.lang.NullPointerException
     [java] 183)
queryTest_238a75ca63f7b0da.xml(mondrian.test.comp.ResultComparatorTest)java.
lang.NullPointerException
     [java] 184)
queryTest_41abb42ac6e42b22.xml(mondrian.test.comp.ResultComparatorTest)java.
lang.NullPointerException
     [java] 185)
queryTest_coalesceEmpty_5dc721f6c5ff5751.xml(mondrian.test.comp.ResultCompar
atorTest)java.lang.NullPointerException
     [java] 186)
queryTest_prevMember_79545abdc7d7cab7.xml(mondrian.test.comp.ResultComparato
rTest)java.lang.NullPointerException
     [java] 187)
queryTest_3b6a02511345dcc.xml(mondrian.test.comp.ResultComparatorTest)java.l
ang.NullPointerException
     [java] 188)
queryTest_267530ffa034ac5a.xml(mondrian.test.comp.ResultComparatorTest)java.
lang.NullPointerException
     [java] 189)
queryTest_2cbb2b1ddd693b30.xml(mondrian.test.comp.ResultComparatorTest)java.
lang.NullPointerException
     [java] 190)
queryTest_d04bbeb9c48a09c.xml(mondrian.test.comp.ResultComparatorTest)java.l
ang.NullPointerException
     [java] 191)
queryTest_c63fa1f3ad94ce_CLOSINGPERIOD.xml(mondrian.test.comp.ResultComparat
orTest)java.lang.NullPointerException
     [java] 192)
queryTest_2e94118cec3f1c0_PeriodsToDate.xml(mondrian.test.comp.ResultCompara
torTest)java.lang.NullPointerException
     [java] 193)
queryTest_a0f9f4f161c69f2c_TOPSUM.xml(mondrian.test.comp.ResultComparatorTes
t)java.lang.NullPointerException
     [java] 194)
testDrillThrough(mondrian.test.DrillThroughTest)java.lang.NullPointerExcepti
on
     [java] 195)
testDrillThrough2(mondrian.test.DrillThroughTest)java.lang.NullPointerExcept
ion
     [java] 196)
testDrillThrough3(mondrian.test.DrillThroughTest)java.lang.NullPointerExcept
ion
     [java] 197)
testDrillThroughBug1472311(mondrian.test.DrillThroughTest)java.lang.NullPoin
terException
     [java] 198)
testDrillThroughMeasureExp(mondrian.test.DrillThroughTest)java.lang.NullPoin
terException
     [java] 199)
testDrillThroughDupKeys(mondrian.test.DrillThroughTest)java.lang.NullPointer
Exception
     [java] 200)
testDrillThroughVirtualCube(mondrian.test.DrillThroughTest)java.lang.NullPoi
nterException
     [java] 201)
testBug1438285(mondrian.test.DrillThroughTest)java.lang.NullPointerException
     [java] 202)
testSample0(mondrian.test.BasicQueryTest)java.lang.NullPointerException
     [java] 203)
testSample1(mondrian.test.BasicQueryTest)java.lang.NullPointerException
     [java] 204)
testSample2(mondrian.test.BasicQueryTest)java.lang.NullPointerException
     [java] 205)
testSample3(mondrian.test.BasicQueryTest)java.lang.NullPointerException
     [java] 206)
testSample4(mondrian.test.BasicQueryTest)java.lang.NullPointerException
     [java] 207)
testSample5(mondrian.test.BasicQueryTest)java.lang.NullPointerException
     [java] 208)
testSample6(mondrian.test.BasicQueryTest)java.lang.NullPointerException
     [java] 209)
testSample7(mondrian.test.BasicQueryTest)java.lang.NullPointerException
     [java] 210)
testSample8(mondrian.test.BasicQueryTest)java.lang.NullPointerException
     [java] 211)
testGoodComments(mondrian.test.BasicQueryTest)java.lang.NullPointerException
     [java] 212)
testBothAxesEmpty(mondrian.test.BasicQueryTest)java.lang.NullPointerExceptio
n
     [java] 213)
testBigQuery(mondrian.test.BasicQueryTest)java.lang.NullPointerException
     [java] 214)
testNonEmpty1(mondrian.test.BasicQueryTest)java.lang.NullPointerException
     [java] 215)
testNonEmpty2(mondrian.test.BasicQueryTest)java.lang.NullPointerException
     [java] 216)
testOneDimensionalQueryWithCompoundSlicer(mondrian.test.BasicQueryTest)java.
lang.NullPointerException
     [java] 217)
testSlicerIsEvaluatedBeforeAxes(mondrian.test.BasicQueryTest)java.lang.NullP
ointerException
     [java] 218)
testSlicerWithCalculatedMembers(mondrian.test.BasicQueryTest)java.lang.NullP
ointerException
     [java] 219)
testSolveOrder(mondrian.test.BasicQueryTest)java.lang.NullPointerException
     [java] 220)
testSolveOrderNonMeasure(mondrian.test.BasicQueryTest)java.lang.NullPointerE
xception
     [java] 221)
testSolveOrderNonMeasure2(mondrian.test.BasicQueryTest)java.lang.NullPointer
Exception
     [java] 222)
testSolveOrderAmbiguous1(mondrian.test.BasicQueryTest)java.lang.NullPointerE
xception
     [java] 223)
testSolveOrderAmbiguous2(mondrian.test.BasicQueryTest)java.lang.NullPointerE
xception
     [java] 224)
testCalculatedMemberWhichIsNotAMeasure(mondrian.test.BasicQueryTest)java.lan
g.NullPointerException
     [java] 225)
testMultipleCalculatedMembersWhichAreNotMeasures(mondrian.test.BasicQueryTes
t)java.lang.NullPointerException
     [java] 226)
testMultipleCalculatedMembersWhichAreNotMeasures2(mondrian.test.BasicQueryTe
st)java.lang.NullPointerException
     [java] 227)
testMultipleCalculatedMembersWhichAreNotMeasures3(mondrian.test.BasicQueryTe
st)java.lang.NullPointerException
     [java] 228)
testConstantString(mondrian.test.BasicQueryTest)java.lang.NullPointerExcepti
on
     [java] 229)
testConstantNumber(mondrian.test.BasicQueryTest)java.lang.NullPointerExcepti
on
     [java] 230)
testCyclicalCalculatedMembers(mondrian.test.BasicQueryTest)java.lang.NullPoi
nterException
     [java] 231)
testCycle(mondrian.test.BasicQueryTest)java.lang.NullPointerException
     [java] 232)
testHalfYears(mondrian.test.BasicQueryTest)java.lang.NullPointerException
     [java] 233)
testAsSample7ButUsingVirtualCube(mondrian.test.BasicQueryTest)java.lang.Null
PointerException
     [java] 234)
testVirtualCube(mondrian.test.BasicQueryTest)java.lang.NullPointerException
     [java] 235)
testUseDimensionAsShorthandForMember(mondrian.test.BasicQueryTest)java.lang.
NullPointerException
     [java] 236)
testTaglib0(mondrian.test.BasicQueryTest)java.lang.NullPointerException
     [java] 237)
testTaglib1(mondrian.test.BasicQueryTest)java.lang.NullPointerException
     [java] 238)
testTaglib2(mondrian.test.BasicQueryTest)java.lang.NullPointerException
     [java] 239)
testTaglib3(mondrian.test.BasicQueryTest)java.lang.NullPointerException
     [java] 240)
testTaglib4(mondrian.test.BasicQueryTest)java.lang.NullPointerException
     [java] 241)
testTaglib5(mondrian.test.BasicQueryTest)java.lang.NullPointerException
     [java] 242)
testCellValue(mondrian.test.BasicQueryTest)java.lang.NullPointerException
     [java] 243)
testDynamicFormat(mondrian.test.BasicQueryTest)java.lang.NullPointerExceptio
n
     [java] 244)
testFormatOfNulls(mondrian.test.BasicQueryTest)java.lang.NullPointerExceptio
n
     [java] 245)
testBug761196(mondrian.test.BasicQueryTest)java.lang.NullPointerException
     [java] 246)
testBug761952(mondrian.test.BasicQueryTest)java.lang.NullPointerException
     [java] 247)
testBug804903(mondrian.test.BasicQueryTest)java.lang.NullPointerException
     [java] 248)
testStoreCube(mondrian.test.BasicQueryTest)java.lang.NullPointerException
     [java] 249)
testBug645744(mondrian.test.BasicQueryTest)java.lang.NullPointerException
     [java] 250)
testBug636687(mondrian.test.BasicQueryTest)java.lang.NullPointerException
     [java] 251)
testBug769114(mondrian.test.BasicQueryTest)java.lang.NullPointerException
     [java] 252)
testCatalogHierarchyBasedOnView(mondrian.test.BasicQueryTest)java.lang.NullP
ointerException
     [java] 253)
testCatalogHierarchyBasedOnView2(mondrian.test.BasicQueryTest)java.lang.Null
PointerException
     [java] 254)
testCountDistinct(mondrian.test.BasicQueryTest)java.lang.NullPointerExceptio
n
     [java] 255)
testCountDistinctAgg(mondrian.test.BasicQueryTest)java.lang.NullPointerExcep
tion
     [java] 256)
testMemberWithNullKey(mondrian.test.BasicQueryTest)java.lang.NullPointerExce
ption
     [java] 257)
testSlicerOverride(mondrian.test.BasicQueryTest)java.lang.NullPointerExcepti
on
     [java] 258)
testMembersOfLargeDimensionTheHardWay(mondrian.test.BasicQueryTest)java.lang
.NullPointerException
     [java] 259)
testUnparse(mondrian.test.BasicQueryTest)java.lang.NullPointerException
     [java] 260)
testUnparse2(mondrian.test.BasicQueryTest)java.lang.NullPointerException
     [java] 261)
testBasketAnalysis(mondrian.test.BasicQueryTest)java.lang.NullPointerExcepti
on
     [java] 262)
testBasketAnalysisAfterFlush(mondrian.test.BasicQueryTest)java.lang.NullPoin
terException
     [java] 263)
testPercentagesAsMeasures(mondrian.test.BasicQueryTest)java.lang.NullPointer
Exception
     [java] 264)
testLogicalOps(mondrian.test.BasicQueryTest)java.lang.NullPointerException
     [java] 265)
testLogicalAnd(mondrian.test.BasicQueryTest)java.lang.NullPointerException
     [java] 266)
testCustomMemberProperties(mondrian.test.BasicQueryTest)java.lang.NullPointe
rException
     [java] 267)
testTopmost2(mondrian.test.BasicQueryTest)java.lang.NullPointerException
     [java] 268)
testRank(mondrian.test.BasicQueryTest)java.lang.NullPointerException
     [java] 269)
testDifferentCalculationsForDifferentLevels(mondrian.test.BasicQueryTest)jav
a.lang.NullPointerException
     [java] 270)
testDifferentCalculations2(mondrian.test.BasicQueryTest)java.lang.NullPointe
rException
     [java] 271)
testDifferentCalcsForDifferentTimePeriods(mondrian.test.BasicQueryTest)java.
lang.NullPointerException
     [java] 272)
testDependsOn(mondrian.test.BasicQueryTest)java.lang.NullPointerException
     [java] 273)
testFilteredCrossJoin(mondrian.test.BasicQueryTest)java.lang.NullPointerExce
ption
     [java] 274)
testNonEmptyNonEmptyCrossJoin1(mondrian.test.BasicQueryTest)java.lang.NullPo
interException
     [java] 275)
testNonEmptyNonEmptyCrossJoin2(mondrian.test.BasicQueryTest)java.lang.NullPo
interException
     [java] 276)
testNonEmptyNonEmptyCrossJoin3(mondrian.test.BasicQueryTest)java.lang.NullPo
interException
     [java] 277)
testNonEmptyNonEmptyCrossJoin4(mondrian.test.BasicQueryTest)java.lang.NullPo
interException
     [java] 278)
testHierDifferentKeyClass(mondrian.test.BasicQueryTest)java.lang.NullPointer
Exception
     [java] 279)
testOverlappingCalculatedMembers(mondrian.test.BasicQueryTest)java.lang.Null
PointerException
     [java] 280)
testEmptyProperty(mondrian.test.BasicQueryTest)java.lang.NullPointerExceptio
n
     [java] 281)
testMemberVisibility(mondrian.test.BasicQueryTest)java.lang.NullPointerExcep
tion
     [java] 282)
testAllMemberCaption(mondrian.test.BasicQueryTest)java.lang.NullPointerExcep
tion
     [java] 283)
testAllLevelName(mondrian.test.BasicQueryTest)java.lang.NullPointerException
     [java] 284)
testDimWithoutAll(mondrian.test.BasicQueryTest)java.lang.NullPointerExceptio
n
     [java] 285)
testMemberOnAxis(mondrian.test.BasicQueryTest)java.lang.NullPointerException
     [java] 286)
testNullMember(mondrian.test.BasicQueryTest)java.lang.NullPointerException
     [java] 287)
testNullMemberWithOneNonNull(mondrian.test.BasicQueryTest)java.lang.NullPoin
terException
     [java] 288)
testMultipleConstraintsOnSameColumn(mondrian.test.BasicQueryTest)java.lang.N
ullPointerException
     [java] 289)
testOverrideDimension(mondrian.test.BasicQueryTest)java.lang.NullPointerExce
ption
     [java] 290)
testMemberOrdinalCaching(mondrian.test.BasicQueryTest)java.lang.NullPointerE
xception
     [java] 291)
testCancel(mondrian.test.BasicQueryTest)java.lang.NullPointerException
     [java] 292)
testFormatInheritance(mondrian.test.BasicQueryTest)java.lang.NullPointerExce
ption
     [java] 293)
testFormatInheritanceWithIIF(mondrian.test.BasicQueryTest)java.lang.NullPoin
terException
     [java] 294)
testFormatInheritanceWorksWithFirstFormatItFinds(mondrian.test.BasicQueryTes
t)java.lang.NullPointerException
     [java] 295)
testAvgCastProblem(mondrian.test.BasicQueryTest)java.lang.NullPointerExcepti
on
     [java] 296)
testFormatInheritanceToPickupFormatFromSecondMeasureWhenTheFirstDoesNotHaveO
ne(mondrian.test.BasicQueryTest)java.lang.NullPointerException
     [java] 297)
testFormatInheritanceWithComplexExpressionToAssertThatTheFormatOfTheFisrtMem
berThatHasAValidFormatIsUsed(mondrian.test.BasicQueryTest)java.lang.NullPoin
terException
     [java] 298)
testGetCaptionUsingMemberDotCaption(mondrian.test.BasicQueryTest)java.lang.N
ullPointerException
     [java] 299)
testGetCaptionUsingMemberDotPropertiesCaption(mondrian.test.BasicQueryTest)j
ava.lang.NullPointerException
     [java] 300)
testDefaultMeasureInCube(mondrian.test.BasicQueryTest)java.lang.NullPointerE
xception
     [java] 301)
testDefaultMeasureInCubeForIncorrectMeasureName(mondrian.test.BasicQueryTest
)java.lang.NullPointerException
     [java] 302)
testDefaultMeasureInCubeForCaseSensitivity(mondrian.test.BasicQueryTest)java
.lang.NullPointerException
     [java] 303)
testNumericToLogicalConversion(mondrian.test.BasicQueryTest)java.lang.NullPo
interException
     [java] 304)
testRollupQuery(mondrian.test.BasicQueryTest)java.lang.NullPointerException
     [java] 305)
testBug1630754(mondrian.test.BasicQueryTest)java.lang.NullPointerException
     [java] 306)
testNonEmptyCrossjoinFilter(mondrian.test.BasicQueryTest)java.lang.NullPoint
erException
     [java] 307)
testHeadCrossjoinComplex(mondrian.test.clearview.CVBasicTest)java.lang.NullP
ointerException
     [java] 308)
testLer4260(mondrian.test.clearview.CVBasicTest)java.lang.NullPointerExcepti
on
     [java] 309)
testGrandTotalColTwoMeasures(mondrian.test.clearview.GrandTotalTest)java.lan
g.NullPointerException
     [java] 310)
testGrandTotals(mondrian.test.clearview.GrandTotalTest)java.lang.NullPointer
Exception
     [java] 311)
testGrandTotalsCols(mondrian.test.clearview.GrandTotalTest)java.lang.NullPoi
nterException
     [java] 312)
testGrandTotalsAll(mondrian.test.clearview.GrandTotalTest)java.lang.NullPoin
terException
     [java] 313)
testGrandNonVisualColumn(mondrian.test.clearview.GrandTotalTest)java.lang.Nu
llPointerException
     [java] 314)
testMetricFilterOnAttribute(mondrian.test.clearview.MetricFilterTest)java.la
ng.NullPointerException
     [java] 315)
testMetricFilterAtLowestLevel(mondrian.test.clearview.MetricFilterTest)java.
lang.NullPointerException
     [java] 316)
testMetricFilterAtParentLevel(mondrian.test.clearview.MetricFilterTest)java.
lang.NullPointerException
     [java] 317)
testMetricFilterNoFilter(mondrian.test.clearview.MetricFilterTest)java.lang.
NullPointerException
     [java] 318)
testMetricFilterLessThan(mondrian.test.clearview.MetricFilterTest)java.lang.
NullPointerException
     [java] 319)
testMetricFilterOnNonVisualTotal(mondrian.test.clearview.MetricFilterTest)ja
va.lang.NullPointerException
     [java] 320)
testMetricFilterOnLowestLevelWithHigherLevelSelections(mondrian.test.clearvi
ew.MetricFilterTest)java.lang.NullPointerException
     [java] 321)
testMetricFilterWithNoSubtotals(mondrian.test.clearview.MetricFilterTest)jav
a.lang.NullPointerException
     [java] 322)
testMetricFilterOnAverageSubtotal(mondrian.test.clearview.MetricFilterTest)j
ava.lang.NullPointerException
     [java] 323)
testMetricTwoFilterOnAttribute(mondrian.test.clearview.MetricFilterTest)java
.lang.NullPointerException
     [java] 324)
testMetricFilterWithNoReportMeasure(mondrian.test.clearview.MetricFilterTest
)java.lang.NullPointerException
     [java] 325)
testMetricFiltersWithNoSubtotals(mondrian.test.clearview.MetricFilterTest)ja
va.lang.NullPointerException
     [java] 326)
testMetricFilterThreeLevels(mondrian.test.clearview.MetricFilterTest)java.la
ng.NullPointerException
     [java] 327)
testSolveOrder(mondrian.test.clearview.MiscTest)java.lang.NullPointerExcepti
on
     [java] 328)
testFilterAtSameLevel(mondrian.test.clearview.PredicateFilterTest)java.lang.
NullPointerException
     [java] 329)
testFilterAtHigherLevel(mondrian.test.clearview.PredicateFilterTest)java.lan
g.NullPointerException
     [java] 330)
testFilterEqualsWithNoValues(mondrian.test.clearview.PredicateFilterTest)jav
a.lang.NullPointerException
     [java] 331)
testFilterAtLowerLevel(mondrian.test.clearview.PredicateFilterTest)java.lang
.NullPointerException
     [java] 332)
testFilterWithTimeRangeBetween(mondrian.test.clearview.PredicateFilterTest)j
ava.lang.NullPointerException
     [java] 333)
testFilterOnSlicerAxis(mondrian.test.clearview.PredicateFilterTest)java.lang
.NullPointerException
     [java] 334)
testFilterOnTwoLevelsInHierarchy(mondrian.test.clearview.PredicateFilterTest
)java.lang.NullPointerException
     [java] 335)
testFilterWithTimeRangeBefore(mondrian.test.clearview.PredicateFilterTest)ja
va.lang.NullPointerException
     [java] 336)
testFilterWithTimeRangeAfter(mondrian.test.clearview.PredicateFilterTest)jav
a.lang.NullPointerException
     [java] 337)
testFilterNotEquals(mondrian.test.clearview.PredicateFilterTest)java.lang.Nu
llPointerException
     [java] 338)
testFilterContains(mondrian.test.clearview.PredicateFilterTest)java.lang.Nul
lPointerException
     [java] 339)
testFilterCurrentYear(mondrian.test.clearview.PredicateFilterTest)java.lang.
NullPointerException
     [java] 340)
testFilterPreviousCurrentAndNext(mondrian.test.clearview.PredicateFilterTest
)java.lang.NullPointerException
     [java] 341)
testFilterDisplayYearAndFilterYearQtrMonth(mondrian.test.clearview.Predicate
FilterTest)java.lang.NullPointerException
     [java] 342)
testFilterMultipleLevelsOnSlicer(mondrian.test.clearview.PredicateFilterTest
)java.lang.NullPointerException
     [java] 343)
testSubtotals(mondrian.test.clearview.SubTotalTest)java.lang.NullPointerExce
ption
     [java] 344)
testNoGrandTotals(mondrian.test.clearview.SubTotalTest)java.lang.NullPointer
Exception
     [java] 345)
testSubtotalsNonVisual(mondrian.test.clearview.SubTotalTest)java.lang.NullPo
interException
     [java] 346)
testSubtotalsCols(mondrian.test.clearview.SubTotalTest)java.lang.NullPointer
Exception
     [java] 347)
testSubtotalsEmptyRow(mondrian.test.clearview.SubTotalTest)java.lang.NullPoi
nterException
     [java] 348)
testSubTotalsOnAndOff(mondrian.test.clearview.SubTotalTest)java.lang.NullPoi
nterException
     [java] 349)
testSpecialMetricPctOfGrand(mondrian.test.clearview.SummaryMetricPercentTest
)java.lang.NullPointerException
     [java] 350)
testSpecialMetricPctOfCol(mondrian.test.clearview.SummaryMetricPercentTest)j
ava.lang.NullPointerException
     [java] 351)
testSpecialMetricPctOfRow(mondrian.test.clearview.SummaryMetricPercentTest)j
ava.lang.NullPointerException
     [java] 352)
testSpecialMetricPctOfLabelFieldWithHierarchy(mondrian.test.clearview.Summar
yMetricPercentTest)java.lang.NullPointerException
     [java] 353)
testSpecialMetricPctOfLabelFieldNoHierarchy(mondrian.test.clearview.SummaryM
etricPercentTest)java.lang.NullPointerException
     [java] 354)
testSpecialMetricPctOfLabelFieldNonVisual(mondrian.test.clearview.SummaryMet
ricPercentTest)java.lang.NullPointerException
     [java] 355)
testSpecialMetricPctOfLabelFieldOnCols(mondrian.test.clearview.SummaryMetric
PercentTest)java.lang.NullPointerException
     [java] 356)
testSpecialMetricPctOfLabelFieldWithHierarchyAndParentLevelMetricFilter(mond
rian.test.clearview.SummaryMetricPercentTest)java.lang.NullPointerException
     [java] 357)
testSpecialMetricPctOfLabelFieldWithHierarchyAndLowestLevelMetricFilter(mond
rian.test.clearview.SummaryMetricPercentTest)java.lang.NullPointerException
     [java] 358)
testSummaryMetricPctNonVisualGrand(mondrian.test.clearview.SummaryMetricPerc
entTest)java.lang.NullPointerException
     [java] 359)
testSpecialMetricRSUMPctOfRow(mondrian.test.clearview.SummaryTest)java.lang.
NullPointerException
     [java] 360)
testSpecialMetricRSUMPctOfRowOnAttribute(mondrian.test.clearview.SummaryTest
)java.lang.NullPointerException
     [java] 361)
testSpecialMetricRankOnRow(mondrian.test.clearview.SummaryTest)java.lang.Nul
lPointerException
     [java] 362)
testSpecialMetricRankOnCol(mondrian.test.clearview.SummaryTest)java.lang.Nul
lPointerException
     [java] 363)
testSpecialMetricRankOnHierarchyParentLevel(mondrian.test.clearview.SummaryT
est)java.lang.NullPointerException
     [java] 364)
testSpecialMetricRankOnHierarchyLowestLevel(mondrian.test.clearview.SummaryT
est)java.lang.NullPointerException
     [java] 365)
testSpecialMetricRankWithHierarchyAndLowestLevelMetricFilter(mondrian.test.c
learview.SummaryTest)java.lang.NullPointerException
     [java] 366)
testSpecialMetricRankWithTop3(mondrian.test.clearview.SummaryTest)java.lang.
NullPointerException
     [java] 367)
testRunningSumWithBreakOnHierarchy(mondrian.test.clearview.SummaryTest)java.
lang.NullPointerException
     [java] 368)
testRunningSumWithBreakOnAttribute(mondrian.test.clearview.SummaryTest)java.
lang.NullPointerException
     [java] 369)
testRunningSumOnRows(mondrian.test.clearview.SummaryTest)java.lang.NullPoint
erException
     [java] 370)
testRunningSumWithSort(mondrian.test.clearview.SummaryTest)java.lang.NullPoi
nterException
     [java] 371)
testBottom(mondrian.test.clearview.TopBottomTest)java.lang.NullPointerExcept
ion
     [java] 372)
testBottomFromManyRows(mondrian.test.clearview.TopBottomTest)java.lang.NullP
ointerException
     [java] 373)
testBottomWithEmptyCells(mondrian.test.clearview.TopBottomTest)java.lang.Nul
lPointerException
     [java] 374)
testBottomWithNonEmptyCells(mondrian.test.clearview.TopBottomTest)java.lang.
NullPointerException
     [java] 375)
testTopMetricFilterOnAttribute(mondrian.test.clearview.TopBottomTest)java.la
ng.NullPointerException
     [java] 376)
testTopMetricFilterOnLowestLevel(mondrian.test.clearview.TopBottomTest)java.
lang.NullPointerException
     [java] 377)
testTopMetricFilterOnParentLevel(mondrian.test.clearview.TopBottomTest)java.
lang.NullPointerException
     [java] 378)
testTopMetricFilterOnParentLevelWithConditions(mondrian.test.clearview.TopBo
ttomTest)java.lang.NullPointerException
     [java] 379)
testTopMetricFilterWithSummaryMetric(mondrian.test.clearview.TopBottomTest)j
ava.lang.NullPointerException
     [java] 380)
testTopMetricWithThreeLevelHierarchy(mondrian.test.clearview.TopBottomTest)j
ava.lang.NullPointerException
     [java] 381)
testTop3NonVisualPctOf(mondrian.test.clearview.TopBottomTest)java.lang.NullP
ointerException
     [java] 382)
testBottom10CurrentYear(mondrian.test.clearview.TopBottomTest)java.lang.Null
PointerException
     [java] 383)
testTopMetricFilterReversedHiearchy(mondrian.test.clearview.TopBottomTest)ja
va.lang.NullPointerException
     [java] 384)
testCreateCellRegion(mondrian.rolap.CacheControlTest)java.lang.NullPointerEx
ception
     [java] 385)
testNormalize2(mondrian.rolap.CacheControlTest)java.lang.NullPointerExceptio
n
     [java] 386)
testNegative(mondrian.rolap.CacheControlTest)java.lang.NullPointerException
     [java] 387)
testCrossjoin(mondrian.rolap.CacheControlTest)java.lang.NullPointerException
     [java] 388)
testNormalize(mondrian.rolap.CacheControlTest)java.lang.NullPointerException
     [java] 389)
testCount(mondrian.olap.fun.FunctionTest)java.lang.NullPointerException
     [java] 390)
testRank(mondrian.olap.fun.FunctionTest)java.lang.NullPointerException
     [java] 391)
testNonEmptyCrossJoin(mondrian.olap.fun.FunctionTest)java.lang.NullPointerEx
ception
     [java] 392)
testNullMember(mondrian.olap.fun.FunctionTest)java.lang.NullPointerException
     [java] 393)
testGetCaptionUsingMemberDotCaption(mondrian.olap.fun.FunctionTest)java.lang
.NullPointerException
     [java] 394)
testNumericLiteral(mondrian.olap.fun.FunctionTest)java.lang.NullPointerExcep
tion
     [java] 395)
testStringLiteral(mondrian.olap.fun.FunctionTest)java.lang.NullPointerExcept
ion
     [java] 396)
testDimensionHierarchy(mondrian.olap.fun.FunctionTest)java.lang.NullPointerE
xception
     [java] 397)
testLevelDimension(mondrian.olap.fun.FunctionTest)java.lang.NullPointerExcep
tion
     [java] 398)
testMemberDimension(mondrian.olap.fun.FunctionTest)java.lang.NullPointerExce
ption
     [java] 399)
testDimensionsNumeric(mondrian.olap.fun.FunctionTest)java.lang.NullPointerEx
ception
     [java] 400)
testDimensionsString(mondrian.olap.fun.FunctionTest)java.lang.NullPointerExc
eption
     [java] 401)
testDimensionsDepends(mondrian.olap.fun.FunctionTest)java.lang.NullPointerEx
ception
     [java] 402)
testTime(mondrian.olap.fun.FunctionTest)java.lang.NullPointerException
     [java] 403)
testBasic9(mondrian.olap.fun.FunctionTest)java.lang.NullPointerException
     [java] 404)
testFirstInLevel9(mondrian.olap.fun.FunctionTest)java.lang.NullPointerExcept
ion
     [java] 405)
testHierarchyAll(mondrian.olap.fun.FunctionTest)java.lang.NullPointerExcepti
on
     [java] 406)
testNullValue(mondrian.olap.fun.FunctionTest)java.lang.NullPointerException
     [java] 407)
testNullInMultiplication(mondrian.olap.fun.FunctionTest)java.lang.NullPointe
rException
     [java] 408)
testNullInAddition(mondrian.olap.fun.FunctionTest)java.lang.NullPointerExcep
tion
     [java] 409)
testNullInSubtraction(mondrian.olap.fun.FunctionTest)java.lang.NullPointerEx
ception
     [java] 410)
testMemberLevel(mondrian.olap.fun.FunctionTest)java.lang.NullPointerExceptio
n
     [java] 411)
testLevelsNumeric(mondrian.olap.fun.FunctionTest)java.lang.NullPointerExcept
ion
     [java] 412)
testLevelsString(mondrian.olap.fun.FunctionTest)java.lang.NullPointerExcepti
on
     [java] 413)
testIsEmptyQuery(mondrian.olap.fun.FunctionTest)java.lang.NullPointerExcepti
on
     [java] 414)
testIsEmptyWithAggregate(mondrian.olap.fun.FunctionTest)java.lang.NullPointe
rException
     [java] 415)
testIsEmpty(mondrian.olap.fun.FunctionTest)java.lang.NullPointerException
     [java] 416)
testQueryWithoutValidMeasure(mondrian.olap.fun.FunctionTest)java.lang.NullPo
interException
     [java] 417)
testValidMeasure(mondrian.olap.fun.FunctionTest)java.lang.NullPointerExcepti
on
     [java] 418)
testValidMeasureTupleHasAnotherMember(mondrian.olap.fun.FunctionTest)java.la
ng.NullPointerException
     [java] 419)
testValidMeasureDepends(mondrian.olap.fun.FunctionTest)java.lang.NullPointer
Exception
     [java] 420)
testAncestor(mondrian.olap.fun.FunctionTest)java.lang.NullPointerException
     [java] 421)
testAncestorNumeric(mondrian.olap.fun.FunctionTest)java.lang.NullPointerExce
ption
     [java] 422)
testAncestorHigher(mondrian.olap.fun.FunctionTest)java.lang.NullPointerExcep
tion
     [java] 423)
testAncestorSameLevel(mondrian.olap.fun.FunctionTest)java.lang.NullPointerEx
ception
     [java] 424)
testAncestorWrongHierarchy(mondrian.olap.fun.FunctionTest)java.lang.NullPoin
terException
     [java] 425)
testAncestorAllLevel(mondrian.olap.fun.FunctionTest)java.lang.NullPointerExc
eption
     [java] 426)
testAncestorWithHiddenParent(mondrian.olap.fun.FunctionTest)java.lang.NullPo
interException
     [java] 427)
testAncestorDepends(mondrian.olap.fun.FunctionTest)java.lang.NullPointerExce
ption
     [java] 428)
testOrdinal(mondrian.olap.fun.FunctionTest)java.lang.NullPointerException
     [java] 429)
testClosingPeriodNoArgs(mondrian.olap.fun.FunctionTest)java.lang.NullPointer
Exception
     [java] 430)
testClosingPeriodLevel(mondrian.olap.fun.FunctionTest)java.lang.NullPointerE
xception
     [java] 431)
testClosingPeriodLevelNotInTimeFails(mondrian.olap.fun.FunctionTest)java.lan
g.NullPointerException
     [java] 432)
testClosingPeriodMemberLeaf(mondrian.olap.fun.FunctionTest)java.lang.NullPoi
nterException
     [java] 433)
testClosingPeriod(mondrian.olap.fun.FunctionTest)java.lang.NullPointerExcept
ion
     [java] 434)
testClosingPeriodBelow(mondrian.olap.fun.FunctionTest)java.lang.NullPointerE
xception
     [java] 435)
testCousin1(mondrian.olap.fun.FunctionTest)java.lang.NullPointerException
     [java] 436)
testCousin2(mondrian.olap.fun.FunctionTest)java.lang.NullPointerException
     [java] 437)
testCousinOverrun(mondrian.olap.fun.FunctionTest)java.lang.NullPointerExcept
ion
     [java] 438)
testCousinThreeDown(mondrian.olap.fun.FunctionTest)java.lang.NullPointerExce
ption
     [java] 439)
testCousinSameLevel(mondrian.olap.fun.FunctionTest)java.lang.NullPointerExce
ption
     [java] 440)
testCousinHigherLevel(mondrian.olap.fun.FunctionTest)java.lang.NullPointerEx
ception
     [java] 441)
testCousinWrongHierarchy(mondrian.olap.fun.FunctionTest)java.lang.NullPointe
rException
     [java] 442)
testParent(mondrian.olap.fun.FunctionTest)java.lang.NullPointerException
     [java] 443)
testMembers(mondrian.olap.fun.FunctionTest)java.lang.NullPointerException
     [java] 444)
testHierarchyMembers(mondrian.olap.fun.FunctionTest)java.lang.NullPointerExc
eption
     [java] 445)
testAllMembers(mondrian.olap.fun.FunctionTest)java.lang.NullPointerException
     [java] 446)
testAddCalculatedMembers(mondrian.olap.fun.FunctionTest)java.lang.NullPointe
rException
     [java] 447)
testStripCalculatedMembers(mondrian.olap.fun.FunctionTest)java.lang.NullPoin
terException
     [java] 448)
testCurrentMember(mondrian.olap.fun.FunctionTest)java.lang.NullPointerExcept
ion
     [java] 449)
testCurrentMemberDepends(mondrian.olap.fun.FunctionTest)java.lang.NullPointe
rException
     [java] 450)
testCurrentMemberFromSlicer(mondrian.olap.fun.FunctionTest)java.lang.NullPoi
nterException
     [java] 451)
testCurrentMemberFromDefaultMember(mondrian.olap.fun.FunctionTest)java.lang.
NullPointerException
     [java] 452)
testCurrentMemberMultiHierarchy(mondrian.olap.fun.FunctionTest)java.lang.Nul
lPointerException
     [java] 453)
testCurrentMemberMultiHierarchy2(mondrian.olap.fun.FunctionTest)java.lang.Nu
llPointerException
     [java] 454)
testDefaultMember(mondrian.olap.fun.FunctionTest)java.lang.NullPointerExcept
ion
     [java] 455)
testCurrentMemberFromAxis(mondrian.olap.fun.FunctionTest)java.lang.NullPoint
erException
     [java] 456)
testCurrentMemberInCalcMember(mondrian.olap.fun.FunctionTest)java.lang.NullP
ointerException
     [java] 457)
testDimensionDefaultMember(mondrian.olap.fun.FunctionTest)java.lang.NullPoin
terException
     [java] 458)
testDrilldownLevel(mondrian.olap.fun.FunctionTest)java.lang.NullPointerExcep
tion
     [java] 459)
testDrilldownLevelTop(mondrian.olap.fun.FunctionTest)java.lang.NullPointerEx
ception
     [java] 460)
testDrilldownMemberEmptyExpr(mondrian.olap.fun.FunctionTest)java.lang.NullPo
interException
     [java] 461)
testDrilldownMember(mondrian.olap.fun.FunctionTest)java.lang.NullPointerExce
ption
     [java] 462)
testFirstChildFirstInLevel(mondrian.olap.fun.FunctionTest)java.lang.NullPoin
terException
     [java] 463)
testFirstChildAll(mondrian.olap.fun.FunctionTest)java.lang.NullPointerExcept
ion
     [java] 464)
testFirstChildOfChildless(mondrian.olap.fun.FunctionTest)java.lang.NullPoint
erException
     [java] 465)
testFirstSiblingFirstInLevel(mondrian.olap.fun.FunctionTest)java.lang.NullPo
interException
     [java] 466)
testFirstSiblingLastInLevel(mondrian.olap.fun.FunctionTest)java.lang.NullPoi
nterException
     [java] 467)
testFirstSiblingAll(mondrian.olap.fun.FunctionTest)java.lang.NullPointerExce
ption
     [java] 468)
testFirstSiblingRoot(mondrian.olap.fun.FunctionTest)java.lang.NullPointerExc
eption
     [java] 469)
testFirstSiblingNull(mondrian.olap.fun.FunctionTest)java.lang.NullPointerExc
eption
     [java] 470)
testLag(mondrian.olap.fun.FunctionTest)java.lang.NullPointerException
     [java] 471)
testLagFirstInLevel(mondrian.olap.fun.FunctionTest)java.lang.NullPointerExce
ption
     [java] 472)
testLagAll(mondrian.olap.fun.FunctionTest)java.lang.NullPointerException
     [java] 473)
testLagRoot(mondrian.olap.fun.FunctionTest)java.lang.NullPointerException
     [java] 474)
testLagRootTooFar(mondrian.olap.fun.FunctionTest)java.lang.NullPointerExcept
ion
     [java] 475)
testLastChild(mondrian.olap.fun.FunctionTest)java.lang.NullPointerException
     [java] 476)
testLastChildLastInLevel(mondrian.olap.fun.FunctionTest)java.lang.NullPointe
rException
     [java] 477)
testLastChildAll(mondrian.olap.fun.FunctionTest)java.lang.NullPointerExcepti
on
     [java] 478)
testLastChildOfChildless(mondrian.olap.fun.FunctionTest)java.lang.NullPointe
rException
     [java] 479)
testLastSibling(mondrian.olap.fun.FunctionTest)java.lang.NullPointerExceptio
n
     [java] 480)
testLastSiblingFirstInLevel(mondrian.olap.fun.FunctionTest)java.lang.NullPoi
nterException
     [java] 481)
testLastSiblingAll(mondrian.olap.fun.FunctionTest)java.lang.NullPointerExcep
tion
     [java] 482)
testLastSiblingRoot(mondrian.olap.fun.FunctionTest)java.lang.NullPointerExce
ption
     [java] 483)
testLastSiblingNull(mondrian.olap.fun.FunctionTest)java.lang.NullPointerExce
ption
     [java] 484)
testLead(mondrian.olap.fun.FunctionTest)java.lang.NullPointerException
     [java] 485)
testLeadNegative(mondrian.olap.fun.FunctionTest)java.lang.NullPointerExcepti
on
     [java] 486)
testLeadLastInLevel(mondrian.olap.fun.FunctionTest)java.lang.NullPointerExce
ption
     [java] 487)
testLeadNull(mondrian.olap.fun.FunctionTest)java.lang.NullPointerException
     [java] 488)
testLeadZero(mondrian.olap.fun.FunctionTest)java.lang.NullPointerException
     [java] 489)
testBasic2(mondrian.olap.fun.FunctionTest)java.lang.NullPointerException
     [java] 490)
testFirstInLevel2(mondrian.olap.fun.FunctionTest)java.lang.NullPointerExcept
ion
     [java] 491)
testAll2(mondrian.olap.fun.FunctionTest)java.lang.NullPointerException
     [java] 492)
testBasic5(mondrian.olap.fun.FunctionTest)java.lang.NullPointerException
     [java] 493)
testFirstInLevel5(mondrian.olap.fun.FunctionTest)java.lang.NullPointerExcept
ion
     [java] 494)
testAll5(mondrian.olap.fun.FunctionTest)java.lang.NullPointerException
     [java] 495)
testBasic(mondrian.olap.fun.FunctionTest)java.lang.NullPointerException
     [java] 496)
testFirstInLevel(mondrian.olap.fun.FunctionTest)java.lang.NullPointerExcepti
on
     [java] 497)
testAll(mondrian.olap.fun.FunctionTest)java.lang.NullPointerException
     [java] 498)
testAggregateDepends(mondrian.olap.fun.FunctionTest)java.lang.NullPointerExc
eption
     [java] 499)
testAggregate(mondrian.olap.fun.FunctionTest)java.lang.NullPointerException
     [java] 500)
testAggregate2(mondrian.olap.fun.FunctionTest)java.lang.NullPointerException
     [java] 501)
testAggregateWithIIF(mondrian.olap.fun.FunctionTest)java.lang.NullPointerExc
eption
     [java] 502)
testAggregate2AllMembers(mondrian.olap.fun.FunctionTest)java.lang.NullPointe
rException
     [java] 503)
testAggregateToSimulateCompoundSlicer(mondrian.olap.fun.FunctionTest)java.la
ng.NullPointerException
     [java] 504)
testMultiselectCalculations(mondrian.olap.fun.FunctionTest)java.lang.NullPoi
nterException
     [java] 505)
testAvg(mondrian.olap.fun.FunctionTest)java.lang.NullPointerException
     [java] 506)
testCorrelation(mondrian.olap.fun.FunctionTest)java.lang.NullPointerExceptio
n
     [java] 507)
testCountExcludeEmpty(mondrian.olap.fun.FunctionTest)java.lang.NullPointerEx
ception
     [java] 508)
testCovariance(mondrian.olap.fun.FunctionTest)java.lang.NullPointerException
     [java] 509)
testCovarianceN(mondrian.olap.fun.FunctionTest)java.lang.NullPointerExceptio
n
     [java] 510)
testIIfNumeric(mondrian.olap.fun.FunctionTest)java.lang.NullPointerException
     [java] 511)
testMax(mondrian.olap.fun.FunctionTest)java.lang.NullPointerException
     [java] 512)
testMaxNegative(mondrian.olap.fun.FunctionTest)java.lang.NullPointerExceptio
n
     [java] 513)
testMedian(mondrian.olap.fun.FunctionTest)java.lang.NullPointerException
     [java] 514)
testMedian2(mondrian.olap.fun.FunctionTest)java.lang.NullPointerException
     [java] 515)
testMin(mondrian.olap.fun.FunctionTest)java.lang.NullPointerException
     [java] 516)
testMinTuple(mondrian.olap.fun.FunctionTest)java.lang.NullPointerException
     [java] 517)
testStdev(mondrian.olap.fun.FunctionTest)java.lang.NullPointerException
     [java] 518)
testStdevP(mondrian.olap.fun.FunctionTest)java.lang.NullPointerException
     [java] 519)
testSumNoExp(mondrian.olap.fun.FunctionTest)java.lang.NullPointerException
     [java] 520)
testValue(mondrian.olap.fun.FunctionTest)java.lang.NullPointerException
     [java] 521)
testVar(mondrian.olap.fun.FunctionTest)java.lang.NullPointerException
     [java] 522)
testVarP(mondrian.olap.fun.FunctionTest)java.lang.NullPointerException
     [java] 523)
testAscendants(mondrian.olap.fun.FunctionTest)java.lang.NullPointerException
     [java] 524)
testAscendantsAll(mondrian.olap.fun.FunctionTest)java.lang.NullPointerExcept
ion
     [java] 525)
testAscendantsNull(mondrian.olap.fun.FunctionTest)java.lang.NullPointerExcep
tion
     [java] 526)
testBottomCount(mondrian.olap.fun.FunctionTest)java.lang.NullPointerExceptio
n
     [java] 527)
testBottomPercent(mondrian.olap.fun.FunctionTest)java.lang.NullPointerExcept
ion
     [java] 528)
testBottomSum(mondrian.olap.fun.FunctionTest)java.lang.NullPointerException
     [java] 529)
testExceptEmpty(mondrian.olap.fun.FunctionTest)java.lang.NullPointerExceptio
n
     [java] 530)
testExceptCrossjoin(mondrian.olap.fun.FunctionTest)java.lang.NullPointerExce
ption
     [java] 531)
testExtract(mondrian.olap.fun.FunctionTest)java.lang.NullPointerException
     [java] 532)
testTopPercentCrossjoin(mondrian.olap.fun.FunctionTest)java.lang.NullPointer
Exception
     [java] 533)
testCrossjoinNested(mondrian.olap.fun.FunctionTest)java.lang.NullPointerExce
ption
     [java] 534)
testCrossjoinSingletonTuples(mondrian.olap.fun.FunctionTest)java.lang.NullPo
interException
     [java] 535)
testCrossjoinSingletonTuplesNested(mondrian.olap.fun.FunctionTest)java.lang.
NullPointerException
     [java] 536)
testCrossjoinAsterisk(mondrian.olap.fun.FunctionTest)java.lang.NullPointerEx
ception
     [java] 537)
testCrossjoinAsteriskAssoc(mondrian.olap.fun.FunctionTest)java.lang.NullPoin
terException
     [java] 538)
testCrossjoinAsteriskInsideBraces(mondrian.olap.fun.FunctionTest)java.lang.N
ullPointerException
     [java] 539)
testCrossJoinAsteriskQuery(mondrian.olap.fun.FunctionTest)java.lang.NullPoin
terException
     [java] 540)
testDescendantsM(mondrian.olap.fun.FunctionTest)java.lang.NullPointerExcepti
on
     [java] 541)
testDescendantsDepends(mondrian.olap.fun.FunctionTest)java.lang.NullPointerE
xception
     [java] 542)
testDescendantsML(mondrian.olap.fun.FunctionTest)java.lang.NullPointerExcept
ion
     [java] 543)
testDescendantsMLSelf(mondrian.olap.fun.FunctionTest)java.lang.NullPointerEx
ception
     [java] 544)
testDescendantsMLLeaves(mondrian.olap.fun.FunctionTest)java.lang.NullPointer
Exception
     [java] 545)
testDescendantsMLLeavesRagged(mondrian.olap.fun.FunctionTest)java.lang.NullP
ointerException
     [java] 546)
testDescendantsMNLeaves(mondrian.olap.fun.FunctionTest)java.lang.NullPointer
Exception
     [java] 547)
testDescendantsMLSelfBefore(mondrian.olap.fun.FunctionTest)java.lang.NullPoi
nterException
     [java] 548)
testDescendantsMLSelfBeforeAfter(mondrian.olap.fun.FunctionTest)java.lang.Nu
llPointerException
     [java] 549)
testDescendantsMLBefore(mondrian.olap.fun.FunctionTest)java.lang.NullPointer
Exception
     [java] 550)
testDescendantsMLBeforeAfter(mondrian.olap.fun.FunctionTest)java.lang.NullPo
interException
     [java] 551)
testDescendantsMLAfter(mondrian.olap.fun.FunctionTest)java.lang.NullPointerE
xception
     [java] 552)
testDescendantsMLAfterEnd(mondrian.olap.fun.FunctionTest)java.lang.NullPoint
erException
     [java] 553)
testDescendantsM0(mondrian.olap.fun.FunctionTest)java.lang.NullPointerExcept
ion
     [java] 554)
testDescendantsM2(mondrian.olap.fun.FunctionTest)java.lang.NullPointerExcept
ion
     [java] 555)
testDescendantsM2Self(mondrian.olap.fun.FunctionTest)java.lang.NullPointerEx
ception
     [java] 556)
testDescendantsM2Leaves(mondrian.olap.fun.FunctionTest)java.lang.NullPointer
Exception
     [java] 557)
testDescendantsMFarLeaves(mondrian.olap.fun.FunctionTest)java.lang.NullPoint
erException
     [java] 558)
testDescendantsMFarSelf(mondrian.olap.fun.FunctionTest)java.lang.NullPointer
Exception
     [java] 559)
testDescendantsMNY(mondrian.olap.fun.FunctionTest)java.lang.NullPointerExcep
tion
     [java] 560)
testDescendants2ndHier(mondrian.olap.fun.FunctionTest)java.lang.NullPointerE
xception
     [java] 561)
testDescendantsParentChild(mondrian.olap.fun.FunctionTest)java.lang.NullPoin
terException
     [java] 562)
testDescendantsParentChildBefore(mondrian.olap.fun.FunctionTest)java.lang.Nu
llPointerException
     [java] 563)
testDescendantsParentChildLeaves(mondrian.olap.fun.FunctionTest)java.lang.Nu
llPointerException
     [java] 564)
testDescendantsSBA(mondrian.olap.fun.FunctionTest)java.lang.NullPointerExcep
tion
     [java] 565)
testRange(mondrian.olap.fun.FunctionTest)java.lang.NullPointerException
     [java] 566)
testNullRange(mondrian.olap.fun.FunctionTest)java.lang.NullPointerException
     [java] 567)
testTwoNullRange(mondrian.olap.fun.FunctionTest)java.lang.NullPointerExcepti
on
     [java] 568)
testRangeLarge(mondrian.olap.fun.FunctionTest)java.lang.NullPointerException
     [java] 569)
testRangeStartEqualsEnd(mondrian.olap.fun.FunctionTest)java.lang.NullPointer
Exception
     [java] 570)
testRangeStartEqualsEndLarge(mondrian.olap.fun.FunctionTest)java.lang.NullPo
interException
     [java] 571)
testRangeEndBeforeStart(mondrian.olap.fun.FunctionTest)java.lang.NullPointer
Exception
     [java] 572)
testRangeEndBeforeStartLarge(mondrian.olap.fun.FunctionTest)java.lang.NullPo
interException
     [java] 573)
testRangeBetweenDifferentLevelsIsError(mondrian.olap.fun.FunctionTest)java.l
ang.NullPointerException
     [java] 574)
testRangeBoundedByAll(mondrian.olap.fun.FunctionTest)java.lang.NullPointerEx
ception
     [java] 575)
testRangeBoundedByAllLarge(mondrian.olap.fun.FunctionTest)java.lang.NullPoin
terException
     [java] 576)
testRangeBoundedByNull(mondrian.olap.fun.FunctionTest)java.lang.NullPointerE
xception
     [java] 577)
testRangeBoundedByNullLarge(mondrian.olap.fun.FunctionTest)java.lang.NullPoi
nterException
     [java] 578)
testSetContainingLevelFails(mondrian.olap.fun.FunctionTest)java.lang.NullPoi
nterException
     [java] 579)
testBug715177(mondrian.olap.fun.FunctionTest)java.lang.NullPointerException
     [java] 580)
testBug714707(mondrian.olap.fun.FunctionTest)java.lang.NullPointerException
     [java] 581)
testBug715177c(mondrian.olap.fun.FunctionTest)java.lang.NullPointerException
     [java] 582)
testFormatFixed(mondrian.olap.fun.FunctionTest)java.lang.NullPointerExceptio
n
     [java] 583)
testFormatVariable(mondrian.olap.fun.FunctionTest)java.lang.NullPointerExcep
tion
     [java] 584)
testFormatMember(mondrian.olap.fun.FunctionTest)java.lang.NullPointerExcepti
on
     [java] 585)
testIIf(mondrian.olap.fun.FunctionTest)java.lang.NullPointerException
     [java] 586)
testIIfWithNullAndNumber(mondrian.olap.fun.FunctionTest)java.lang.NullPointe
rException
     [java] 587)
testIsEmptyWithNull(mondrian.olap.fun.FunctionTest)java.lang.NullPointerExce
ption
     [java] 588)
testDimensionCaption(mondrian.olap.fun.FunctionTest)java.lang.NullPointerExc
eption
     [java] 589)
testHierarchyCaption(mondrian.olap.fun.FunctionTest)java.lang.NullPointerExc
eption
     [java] 590)
testLevelCaption(mondrian.olap.fun.FunctionTest)java.lang.NullPointerExcepti
on
     [java] 591)
testMemberCaption(mondrian.olap.fun.FunctionTest)java.lang.NullPointerExcept
ion
     [java] 592)
testDimensionName(mondrian.olap.fun.FunctionTest)java.lang.NullPointerExcept
ion
     [java] 593)
testHierarchyName(mondrian.olap.fun.FunctionTest)java.lang.NullPointerExcept
ion
     [java] 594)
testLevelName(mondrian.olap.fun.FunctionTest)java.lang.NullPointerException
     [java] 595)
testMemberName(mondrian.olap.fun.FunctionTest)java.lang.NullPointerException
     [java] 596)
testDimensionUniqueName(mondrian.olap.fun.FunctionTest)java.lang.NullPointer
Exception
     [java] 597)
testHierarchyUniqueName(mondrian.olap.fun.FunctionTest)java.lang.NullPointer
Exception
     [java] 598)
testLevelUniqueName(mondrian.olap.fun.FunctionTest)java.lang.NullPointerExce
ption
     [java] 599)
testMemberUniqueName(mondrian.olap.fun.FunctionTest)java.lang.NullPointerExc
eption
     [java] 600)
testMemberUniqueNameOfNull(mondrian.olap.fun.FunctionTest)java.lang.NullPoin
terException
     [java] 601)
testCoalesceEmptyDepends(mondrian.olap.fun.FunctionTest)java.lang.NullPointe
rException
     [java] 602)
testCoalesceEmpty(mondrian.olap.fun.FunctionTest)java.lang.NullPointerExcept
ion
     [java] 603)
testBrokenContextBug(mondrian.olap.fun.FunctionTest)java.lang.NullPointerExc
eption
     [java] 604)
testSetItemInt(mondrian.olap.fun.FunctionTest)java.lang.NullPointerException
     [java] 605)
testSetItemString(mondrian.olap.fun.FunctionTest)java.lang.NullPointerExcept
ion
     [java] 606)
testTuple(mondrian.olap.fun.FunctionTest)java.lang.NullPointerException
     [java] 607)
testTupleArgTypes(mondrian.olap.fun.FunctionTest)java.lang.NullPointerExcept
ion
     [java] 608)
testTupleItem(mondrian.olap.fun.FunctionTest)java.lang.NullPointerException
     [java] 609)
testTupleAppliedToUnknownHierarchy(mondrian.olap.fun.FunctionTest)java.lang.
NullPointerException
     [java] 610)
testTupleDepends(mondrian.olap.fun.FunctionTest)java.lang.NullPointerExcepti
on
     [java] 611)
testItemNull(mondrian.olap.fun.FunctionTest)java.lang.NullPointerException
     [java] 612)
testTupleNull(mondrian.olap.fun.FunctionTest)java.lang.NullPointerException
     [java] 613)
testLevelMemberExpressions(mondrian.olap.fun.FunctionTest)java.lang.NullPoin
terException
     [java] 614)
testCaseTestMatch(mondrian.olap.fun.FunctionTest)java.lang.NullPointerExcept
ion
     [java] 615)
testCaseTestMatchElse(mondrian.olap.fun.FunctionTest)java.lang.NullPointerEx
ception
     [java] 616)
testCaseTestMatchNoElse(mondrian.olap.fun.FunctionTest)java.lang.NullPointer
Exception
     [java] 617)
testCaseTestReturnsMemberBug1799391(mondrian.olap.fun.FunctionTest)java.lang
.NullPointerException
     [java] 618)
testCaseMatch(mondrian.olap.fun.FunctionTest)java.lang.NullPointerException
     [java] 619)
testCaseMatchElse(mondrian.olap.fun.FunctionTest)java.lang.NullPointerExcept
ion
     [java] 620)
testCaseMatchNoElse(mondrian.olap.fun.FunctionTest)java.lang.NullPointerExce
ption
     [java] 621)
testCaseTypeMismatch(mondrian.olap.fun.FunctionTest)java.lang.NullPointerExc
eption
     [java] 622)
testPropertiesExpr(mondrian.olap.fun.FunctionTest)java.lang.NullPointerExcep
tion
     [java] 623)
testPropertiesFilter(mondrian.olap.fun.FunctionTest)java.lang.NullPointerExc
eption
     [java] 624)
testPropertyInCalculatedMember(mondrian.olap.fun.FunctionTest)java.lang.Null
PointerException
     [java] 625)
testOpeningPeriod(mondrian.olap.fun.FunctionTest)java.lang.NullPointerExcept
ion
     [java] 626)
testOpeningPeriodNull(mondrian.olap.fun.FunctionTest)java.lang.NullPointerEx
ception
     [java] 627)
testLastPeriods(mondrian.olap.fun.FunctionTest)java.lang.NullPointerExceptio
n
     [java] 628)
testParallelPeriod(mondrian.olap.fun.FunctionTest)java.lang.NullPointerExcep
tion
     [java] 629)
testParallelPeriodDepends(mondrian.olap.fun.FunctionTest)java.lang.NullPoint
erException
     [java] 630)
testParallelPeriodLevelLag(mondrian.olap.fun.FunctionTest)java.lang.NullPoin
terException
     [java] 631)
testParallelPeriodLevel(mondrian.olap.fun.FunctionTest)java.lang.NullPointer
Exception
     [java] 632)
testPlus(mondrian.olap.fun.FunctionTest)java.lang.NullPointerException
     [java] 633)
testMinus(mondrian.olap.fun.FunctionTest)java.lang.NullPointerException
     [java] 634)
testMinus_bug1234759(mondrian.olap.fun.FunctionTest)java.lang.NullPointerExc
eption
     [java] 635)
testMinusAssociativity(mondrian.olap.fun.FunctionTest)java.lang.NullPointerE
xception
     [java] 636)
testMultiply(mondrian.olap.fun.FunctionTest)java.lang.NullPointerException
     [java] 637)
testMultiplyPrecedence(mondrian.olap.fun.FunctionTest)java.lang.NullPointerE
xception
     [java] 638)
testMultiplyBug774807(mondrian.olap.fun.FunctionTest)java.lang.NullPointerEx
ception
     [java] 639)
testDivide(mondrian.olap.fun.FunctionTest)java.lang.NullPointerException
     [java] 640)
testDividePrecedence(mondrian.olap.fun.FunctionTest)java.lang.NullPointerExc
eption
     [java] 641)
testUnaryMinus(mondrian.olap.fun.FunctionTest)java.lang.NullPointerException
     [java] 642)
testUnaryMinusMember(mondrian.olap.fun.FunctionTest)java.lang.NullPointerExc
eption
     [java] 643)
testUnaryMinusPrecedence(mondrian.olap.fun.FunctionTest)java.lang.NullPointe
rException
     [java] 644)
testStringConcat(mondrian.olap.fun.FunctionTest)java.lang.NullPointerExcepti
on
     [java] 645)
testStringConcat2(mondrian.olap.fun.FunctionTest)java.lang.NullPointerExcept
ion
     [java] 646)
testAnd(mondrian.olap.fun.FunctionTest)java.lang.NullPointerException
     [java] 647)
testAnd2(mondrian.olap.fun.FunctionTest)java.lang.NullPointerException
     [java] 648)
testOr(mondrian.olap.fun.FunctionTest)java.lang.NullPointerException
     [java] 649)
testOr2(mondrian.olap.fun.FunctionTest)java.lang.NullPointerException
     [java] 650)
testOrAssociativity1(mondrian.olap.fun.FunctionTest)java.lang.NullPointerExc
eption
     [java] 651)
testOrAssociativity2(mondrian.olap.fun.FunctionTest)java.lang.NullPointerExc
eption
     [java] 652)
testOrAssociativity3(mondrian.olap.fun.FunctionTest)java.lang.NullPointerExc
eption
     [java] 653)
testXor(mondrian.olap.fun.FunctionTest)java.lang.NullPointerException
     [java] 654)
testXorAssociativity(mondrian.olap.fun.FunctionTest)java.lang.NullPointerExc
eption
     [java] 655)
testNot(mondrian.olap.fun.FunctionTest)java.lang.NullPointerException
     [java] 656)
testNotNot(mondrian.olap.fun.FunctionTest)java.lang.NullPointerException
     [java] 657)
testNotAssociativity(mondrian.olap.fun.FunctionTest)java.lang.NullPointerExc
eption
     [java] 658)
testIsNull(mondrian.olap.fun.FunctionTest)java.lang.NullPointerException
     [java] 659)
testIsMember(mondrian.olap.fun.FunctionTest)java.lang.NullPointerException
     [java] 660)
testIsTuple(mondrian.olap.fun.FunctionTest)java.lang.NullPointerException
     [java] 661)
testIsLevel(mondrian.olap.fun.FunctionTest)java.lang.NullPointerException
     [java] 662)
testIsHierarchy(mondrian.olap.fun.FunctionTest)java.lang.NullPointerExceptio
n
     [java] 663)
testIsDimension(mondrian.olap.fun.FunctionTest)java.lang.NullPointerExceptio
n
     [java] 664)
testStringEquals(mondrian.olap.fun.FunctionTest)java.lang.NullPointerExcepti
on
     [java] 665)
testStringEqualsAssociativity(mondrian.olap.fun.FunctionTest)java.lang.NullP
ointerException
     [java] 666)
testStringEqualsEmpty(mondrian.olap.fun.FunctionTest)java.lang.NullPointerEx
ception
     [java] 667)
testEq(mondrian.olap.fun.FunctionTest)java.lang.NullPointerException
     [java] 668)
testStringNe(mondrian.olap.fun.FunctionTest)java.lang.NullPointerException
     [java] 669)
testNe(mondrian.olap.fun.FunctionTest)java.lang.NullPointerException
     [java] 670)
testNeInfinity(mondrian.olap.fun.FunctionTest)java.lang.NullPointerException
     [java] 671)
testLt(mondrian.olap.fun.FunctionTest)java.lang.NullPointerException
     [java] 672)
testLe(mondrian.olap.fun.FunctionTest)java.lang.NullPointerException
     [java] 673)
testGt(mondrian.olap.fun.FunctionTest)java.lang.NullPointerException
     [java] 674)
testGe(mondrian.olap.fun.FunctionTest)java.lang.NullPointerException
     [java] 675)
testDistinctTwoMembers(mondrian.olap.fun.FunctionTest)java.lang.NullPointerE
xception
     [java] 676)
testDistinctThreeMembers(mondrian.olap.fun.FunctionTest)java.lang.NullPointe
rException
     [java] 677)
testDistinctFourMembers(mondrian.olap.fun.FunctionTest)java.lang.NullPointer
Exception
     [java] 678)
testDistinctTwoTuples(mondrian.olap.fun.FunctionTest)java.lang.NullPointerEx
ception
     [java] 679)
testDistinctSomeTuples(mondrian.olap.fun.FunctionTest)java.lang.NullPointerE
xception
     [java] 680)
testFilterWithSlicer(mondrian.olap.fun.FunctionTest)java.lang.NullPointerExc
eption
     [java] 681)
testFilterCompound(mondrian.olap.fun.FunctionTest)java.lang.NullPointerExcep
tion
     [java] 682)
testGenerateDepends(mondrian.olap.fun.FunctionTest)java.lang.NullPointerExce
ption
     [java] 683)
testGenerate(mondrian.olap.fun.FunctionTest)java.lang.NullPointerException
     [java] 684)
testGenerateAll(mondrian.olap.fun.FunctionTest)java.lang.NullPointerExceptio
n
     [java] 685)
testGenerateUnique(mondrian.olap.fun.FunctionTest)java.lang.NullPointerExcep
tion
     [java] 686)
testGenerateUniqueTuple(mondrian.olap.fun.FunctionTest)java.lang.NullPointer
Exception
     [java] 687)
testGenerateCrossJoin(mondrian.olap.fun.FunctionTest)java.lang.NullPointerEx
ception
     [java] 688)
testGenerateString(mondrian.olap.fun.FunctionTest)java.lang.NullPointerExcep
tion
     [java] 689)
testHead(mondrian.olap.fun.FunctionTest)java.lang.NullPointerException
     [java] 690)
testHeadNegative(mondrian.olap.fun.FunctionTest)java.lang.NullPointerExcepti
on
     [java] 691)
testHeadDefault(mondrian.olap.fun.FunctionTest)java.lang.NullPointerExceptio
n
     [java] 692)
testHeadOvershoot(mondrian.olap.fun.FunctionTest)java.lang.NullPointerExcept
ion
     [java] 693)
testHeadEmpty(mondrian.olap.fun.FunctionTest)java.lang.NullPointerException
     [java] 694)
testHierarchize(mondrian.olap.fun.FunctionTest)java.lang.NullPointerExceptio
n
     [java] 695)
testHierarchizePost(mondrian.olap.fun.FunctionTest)java.lang.NullPointerExce
ption
     [java] 696)
testHierarchizeCrossJoinPre(mondrian.olap.fun.FunctionTest)java.lang.NullPoi
nterException
     [java] 697)
testHierarchizeCrossJoinPost(mondrian.olap.fun.FunctionTest)java.lang.NullPo
interException
     [java] 698)
testHierarchizeOrdinal(mondrian.olap.fun.FunctionTest)java.lang.NullPointerE
xception
     [java] 699)
testIntersect(mondrian.olap.fun.FunctionTest)java.lang.NullPointerException
     [java] 700)
testIntersectRightEmpty(mondrian.olap.fun.FunctionTest)java.lang.NullPointer
Exception
     [java] 701)
testIntersectLeftEmpty(mondrian.olap.fun.FunctionTest)java.lang.NullPointerE
xception
     [java] 702)
testOrderDepends(mondrian.olap.fun.FunctionTest)java.lang.NullPointerExcepti
on
     [java] 703)
testOrderCalc(mondrian.olap.fun.FunctionTest)java.lang.NullPointerException
     [java] 704)
testOrder(mondrian.olap.fun.FunctionTest)java.lang.NullPointerException
     [java] 705)
testOrderParentsMissing(mondrian.olap.fun.FunctionTest)java.lang.NullPointer
Exception
     [java] 706)
testOrderCrossJoinBreak(mondrian.olap.fun.FunctionTest)java.lang.NullPointer
Exception
     [java] 707)
testOrderCrossJoin(mondrian.olap.fun.FunctionTest)java.lang.NullPointerExcep
tion
     [java] 708)
testOrderHierarchicalDesc(mondrian.olap.fun.FunctionTest)java.lang.NullPoint
erException
     [java] 709)
testOrderCrossJoinDesc(mondrian.olap.fun.FunctionTest)java.lang.NullPointerE
xception
     [java] 710)
testOrderBug656802(mondrian.olap.fun.FunctionTest)java.lang.NullPointerExcep
tion
     [java] 711)
testOrderBug712702_Simplified(mondrian.olap.fun.FunctionTest)java.lang.NullP
ointerException
     [java] 712)
testOrderBug712702_Original(mondrian.olap.fun.FunctionTest)java.lang.NullPoi
nterException
     [java] 713)
testSiblingsA(mondrian.olap.fun.FunctionTest)java.lang.NullPointerException
     [java] 714)
testSiblingsB(mondrian.olap.fun.FunctionTest)java.lang.NullPointerException
     [java] 715)
testSiblingsC(mondrian.olap.fun.FunctionTest)java.lang.NullPointerException
     [java] 716)
testSiblingsD(mondrian.olap.fun.FunctionTest)java.lang.NullPointerException
     [java] 717)
testSubset(mondrian.olap.fun.FunctionTest)java.lang.NullPointerException
     [java] 718)
testSubsetNegativeCount(mondrian.olap.fun.FunctionTest)java.lang.NullPointer
Exception
     [java] 719)
testSubsetNegativeStart(mondrian.olap.fun.FunctionTest)java.lang.NullPointer
Exception
     [java] 720)
testSubsetDefault(mondrian.olap.fun.FunctionTest)java.lang.NullPointerExcept
ion
     [java] 721)
testSubsetOvershoot(mondrian.olap.fun.FunctionTest)java.lang.NullPointerExce
ption
     [java] 722)
testSubsetEmpty(mondrian.olap.fun.FunctionTest)java.lang.NullPointerExceptio
n
     [java] 723)
testTail(mondrian.olap.fun.FunctionTest)java.lang.NullPointerException
     [java] 724)
testTailNegative(mondrian.olap.fun.FunctionTest)java.lang.NullPointerExcepti
on
     [java] 725)
testTailDefault(mondrian.olap.fun.FunctionTest)java.lang.NullPointerExceptio
n
     [java] 726)
testTailOvershoot(mondrian.olap.fun.FunctionTest)java.lang.NullPointerExcept
ion
     [java] 727)
testTailEmpty(mondrian.olap.fun.FunctionTest)java.lang.NullPointerException
     [java] 728)
testToggleDrillState(mondrian.olap.fun.FunctionTest)java.lang.NullPointerExc
eption
     [java] 729)
testToggleDrillState2(mondrian.olap.fun.FunctionTest)java.lang.NullPointerEx
ception
     [java] 730)
testToggleDrillState3(mondrian.olap.fun.FunctionTest)java.lang.NullPointerEx
ception
     [java] 731)
testToggleDrillStateTuple(mondrian.olap.fun.FunctionTest)java.lang.NullPoint
erException
     [java] 732)
testTopCount(mondrian.olap.fun.FunctionTest)java.lang.NullPointerException
     [java] 733)
testTopCountTuple(mondrian.olap.fun.FunctionTest)java.lang.NullPointerExcept
ion
     [java] 734)
testTopCountEmpty(mondrian.olap.fun.FunctionTest)java.lang.NullPointerExcept
ion
     [java] 735)
testTopCountDepends(mondrian.olap.fun.FunctionTest)java.lang.NullPointerExce
ption
     [java] 736)
testTopPercent(mondrian.olap.fun.FunctionTest)java.lang.NullPointerException
     [java] 737)
testTopSum(mondrian.olap.fun.FunctionTest)java.lang.NullPointerException
     [java] 738)
testTopSumEmpty(mondrian.olap.fun.FunctionTest)java.lang.NullPointerExceptio
n
     [java] 739)
testUnionAll(mondrian.olap.fun.FunctionTest)java.lang.NullPointerException
     [java] 740)
testUnionAllTuple(mondrian.olap.fun.FunctionTest)java.lang.NullPointerExcept
ion
     [java] 741)
testUnion(mondrian.olap.fun.FunctionTest)java.lang.NullPointerException
     [java] 742)
testUnionEmptyBoth(mondrian.olap.fun.FunctionTest)java.lang.NullPointerExcep
tion
     [java] 743)
testUnionEmptyRight(mondrian.olap.fun.FunctionTest)java.lang.NullPointerExce
ption
     [java] 744)
testUnionTuple(mondrian.olap.fun.FunctionTest)java.lang.NullPointerException
     [java] 745)
testUnionTupleDistinct(mondrian.olap.fun.FunctionTest)java.lang.NullPointerE
xception
     [java] 746)
testUnionQuery(mondrian.olap.fun.FunctionTest)java.lang.NullPointerException
     [java] 747)
testItemMember(mondrian.olap.fun.FunctionTest)java.lang.NullPointerException
     [java] 748)
testItemTuple(mondrian.olap.fun.FunctionTest)java.lang.NullPointerException
     [java] 749)
testStrToMember(mondrian.olap.fun.FunctionTest)java.lang.NullPointerExceptio
n
     [java] 750)
testStrToTuple(mondrian.olap.fun.FunctionTest)java.lang.NullPointerException
     [java] 751)
testStrToTupleDepends(mondrian.olap.fun.FunctionTest)java.lang.NullPointerEx
ception
     [java] 752)
testStrToSet(mondrian.olap.fun.FunctionTest)java.lang.NullPointerException
     [java] 753)
testYtd(mondrian.olap.fun.FunctionTest)java.lang.NullPointerException
     [java] 754)
testQtd(mondrian.olap.fun.FunctionTest)java.lang.NullPointerException
     [java] 755)
testMtd(mondrian.olap.fun.FunctionTest)java.lang.NullPointerException
     [java] 756)
testPeriodsToDate(mondrian.olap.fun.FunctionTest)java.lang.NullPointerExcept
ion
     [java] 757)
testSetToStr(mondrian.olap.fun.FunctionTest)java.lang.NullPointerException
     [java] 758)
testTupleToStr(mondrian.olap.fun.FunctionTest)java.lang.NullPointerException
     [java] 759)
testRankWithExpr(mondrian.olap.fun.FunctionTest)java.lang.NullPointerExcepti
on
     [java] 760)
testRankWithExpr2(mondrian.olap.fun.FunctionTest)java.lang.NullPointerExcept
ion
     [java] 761)
testRankWithNulls(mondrian.olap.fun.FunctionTest)java.lang.NullPointerExcept
ion
     [java] 762)
testRankHuge(mondrian.olap.fun.FunctionTest)java.lang.NullPointerException
     [java] 763)
testLinRegPointQuarter(mondrian.olap.fun.FunctionTest)java.lang.NullPointerE
xception
     [java] 764)
testLinRegPointMonth(mondrian.olap.fun.FunctionTest)java.lang.NullPointerExc
eption
     [java] 765)
testLinRegIntercept(mondrian.olap.fun.FunctionTest)java.lang.NullPointerExce
ption
     [java] 766)
testLinRegSlope(mondrian.olap.fun.FunctionTest)java.lang.NullPointerExceptio
n
     [java] 767)
testLinRegPoint(mondrian.olap.fun.FunctionTest)java.lang.NullPointerExceptio
n
     [java] 768)
testVisualTotalsBasic(mondrian.olap.fun.FunctionTest)java.lang.NullPointerEx
ception
     [java] 769)
testVisualTotalsConsecutively(mondrian.olap.fun.FunctionTest)java.lang.NullP
ointerException
     [java] 770)
testVisualTotalsNoPattern(mondrian.olap.fun.FunctionTest)java.lang.NullPoint
erException
     [java] 771)
testVisualTotalsWithFilter(mondrian.olap.fun.FunctionTest)java.lang.NullPoin
terException
     [java] 772)
testVisualTotalsNested(mondrian.olap.fun.FunctionTest)java.lang.NullPointerE
xception
     [java] 773)
testVisualTotalsFilterInside(mondrian.olap.fun.FunctionTest)java.lang.NullPo
interException
     [java] 774)
testVisualTotalsOutOfOrder(mondrian.olap.fun.FunctionTest)java.lang.NullPoin
terException
     [java] 775)
testVisualTotalsGrandparentsAndOutOfOrder(mondrian.olap.fun.FunctionTest)jav
a.lang.NullPointerException
     [java] 776)
testVisualTotalsCrossjoin(mondrian.olap.fun.FunctionTest)java.lang.NullPoint
erException
     [java] 777)
testCalculatedChild(mondrian.olap.fun.FunctionTest)java.lang.NullPointerExce
ption
     [java] 778)
testCalculatedChildUsingItem(mondrian.olap.fun.FunctionTest)java.lang.NullPo
interException
     [java] 779)
testCalculatedChildOnMemberWithNoChildren(mondrian.olap.fun.FunctionTest)jav
a.lang.NullPointerException
     [java] 780)
testCalculatedChildOnNullMember(mondrian.olap.fun.FunctionTest)java.lang.Nul
lPointerException
     [java] 781)
testCast(mondrian.olap.fun.FunctionTest)java.lang.NullPointerException
     [java] 782)
testComplexOrExpr(mondrian.olap.fun.FunctionTest)java.lang.NullPointerExcept
ion
     [java] 783)
testLeftFunctionWithValidArguments(mondrian.olap.fun.FunctionTest)java.lang.
NullPointerException
     [java] 784)
testLeftFunctionWithLengthValueZero(mondrian.olap.fun.FunctionTest)java.lang
.NullPointerException
     [java] 785)
testLeftFunctionWithLengthValueEqualToStringLength(mondrian.olap.fun.Functio
nTest)java.lang.NullPointerException
     [java] 786)
testLeftFunctionWithLengthMoreThanStringLength(mondrian.olap.fun.FunctionTes
t)java.lang.NullPointerException
     [java] 787)
testLeftFunctionWithZeroLengthString(mondrian.olap.fun.FunctionTest)java.lan
g.NullPointerException
     [java] 788)
testMidFunctionWithValidArguments(mondrian.olap.fun.FunctionTest)java.lang.N
ullPointerException
     [java] 789)
testMidFunctionWithZeroLenghtStringArgument(mondrian.olap.fun.FunctionTest)j
ava.lang.NullPointerException
     [java] 790)
testMidFunctionWithLengthArgumentLargerThanStringLength(mondrian.olap.fun.Fu
nctionTest)java.lang.NullPointerException
     [java] 791)
testMidFunctionWithStartIndexGreaterThanStringLength(mondrian.olap.fun.Funct
ionTest)java.lang.NullPointerException
     [java] 792)
testMidFunctionWithStartIndexZero(mondrian.olap.fun.FunctionTest)java.lang.N
ullPointerException
     [java] 793)
testMidFunctionWithoutLength(mondrian.olap.fun.FunctionTest)java.lang.NullPo
interException
     [java] 794)
testLenFunctionWithNonEmptyString(mondrian.olap.fun.FunctionTest)java.lang.N
ullPointerException
     [java] 795)
testLenFunctionWithAnEmptyString(mondrian.olap.fun.FunctionTest)java.lang.Nu
llPointerException
     [java] 796)
testUCaseWithNonEmptyString(mondrian.olap.fun.FunctionTest)java.lang.NullPoi
nterException
     [java] 797)
testUCaseWithEmptyString(mondrian.olap.fun.FunctionTest)java.lang.NullPointe
rException
     [java] 798)
testInStrFunctionWithValidArguments(mondrian.olap.fun.FunctionTest)java.lang
.NullPointerException
     [java] 799)
testIIFWithBooleanBooleanAndNumericParameterForReturningTruePart(mondrian.ol
ap.fun.FunctionTest)java.lang.NullPointerException
     [java] 800)
testIIFWithBooleanBooleanAndNumericParameterForReturningFalsePart(mondrian.o
lap.fun.FunctionTest)java.lang.NullPointerException
     [java] 801)
testIIFWithBooleanBooleanAndNumericParameterForReturningZero(mondrian.olap.f
un.FunctionTest)java.lang.NullPointerException
     [java] 802)
testInStrFunctionWithEmptyString1(mondrian.olap.fun.FunctionTest)java.lang.N
ullPointerException
     [java] 803)
testInStrFunctionWithEmptyString2(mondrian.olap.fun.FunctionTest)java.lang.N
ullPointerException
     [java] 804)
testCache(mondrian.olap.fun.FunctionTest)java.lang.NullPointerException
     [java] 805)
testNoHierarchy(mondrian.olap.HierarchyBugTest)java.lang.NullPointerExceptio
n
     [java] 806)
testOrderDesc(mondrian.olap.fun.SortTest)java.lang.NullPointerException
     [java] 807)
testOrderAndRank(mondrian.olap.fun.SortTest)java.lang.NullPointerException
     [java] 808)
testFemaleUnitSales(mondrian.rolap.TestAggregationManager)java.lang.NullPoin
terException
     [java] 809)
testFemaleCustomerCount(mondrian.rolap.TestAggregationManager)java.lang.Null
PointerException
     [java] 810)
testFemaleCustomerCountWithConstraints(mondrian.rolap.TestAggregationManager
)java.lang.NullPointerException
     [java] 811)
testUniqueMembers(mondrian.rolap.TestAggregationManager)java.lang.NullPointe
rException
     [java] 812)
testNonEmptyCrossJoinLoneAxis(mondrian.rolap.TestAggregationManager)java.lan
g.NullPointerException
     [java] 813)
testHierarchyInFactTable(mondrian.rolap.TestAggregationManager)java.lang.Nul
lPointerException
     [java] 814)
testCountDistinctAggMiss(mondrian.rolap.TestAggregationManager)java.lang.Nul
lPointerException
     [java] 815)
testCountDistinctCannotRollup(mondrian.rolap.TestAggregationManager)java.lan
g.NullPointerException
     [java] 816)
testCountDistinctBatchLoading(mondrian.rolap.TestAggregationManager)java.lan
g.NullPointerException
     [java] 817)
testAggChildMembersOfLeaf(mondrian.rolap.TestAggregationManager)java.lang.Nu
llPointerException
     [java] 818)
testNoNullPtrInCellRequest(mondrian.rolap.TestAggregationManager)java.lang.N
ullPointerException
     [java] 819)
testColumnCadinalityCache(mondrian.rolap.TestAggregationManager)java.lang.Nu
llPointerException
     [java] 820)
testKeyExpressionCardinalityCache(mondrian.rolap.TestAggregationManager)java
.lang.NullPointerException
     [java] 821)
testMemberVisibility(mondrian.rolap.VirtualCubeTest)java.lang.NullPointerExc
eption
     [java] 822)
testNoTimeDimension(mondrian.rolap.VirtualCubeTest)java.lang.NullPointerExce
ption
     [java] 823)
testCalculatedMeasureAsDefaultMeasureInVC(mondrian.rolap.VirtualCubeTest)jav
a.lang.NullPointerException
     [java] 824)
testDefaultMeasureInVCForIncorrectMeasureName(mondrian.rolap.VirtualCubeTest
)java.lang.NullPointerException
     [java] 825)
testDefaultMeasureInVCForCaseSensitivity(mondrian.rolap.VirtualCubeTest)java
.lang.NullPointerException
     [java] 826)
testWithTimeDimension(mondrian.rolap.VirtualCubeTest)java.lang.NullPointerEx
ception
     [java] 827)
testNonDefaultAllMember(mondrian.rolap.VirtualCubeTest)java.lang.NullPointer
Exception
     [java] 828)
testNonDefaultAllMember2(mondrian.rolap.VirtualCubeTest)java.lang.NullPointe
rException
     [java] 829)
testFormatStringExpressionCubeNoCache(mondrian.rolap.VirtualCubeTest)java.la
ng.NullPointerException
     [java] 830)
testCalculatedMeasure(mondrian.rolap.VirtualCubeTest)java.lang.NullPointerEx
ception
     [java] 831)
testLostData(mondrian.rolap.VirtualCubeTest)java.lang.NullPointerException
     [java] 832)
testCalculatedMeasureAcrossCubes(mondrian.rolap.VirtualCubeTest)java.lang.Nu
llPointerException
     [java] 833)
testCalculatedMemberInSchema(mondrian.rolap.VirtualCubeTest)java.lang.NullPo
interException
     [java] 834)
testAllMeasureMembers(mondrian.rolap.VirtualCubeTest)java.lang.NullPointerEx
ception
     [java] 835)
testOrdinalColumn(mondrian.rolap.VirtualCubeTest)java.lang.NullPointerExcept
ion
     [java] 836)
testDefaultMeasureProperty(mondrian.rolap.VirtualCubeTest)java.lang.NullPoin
terException
     [java] 837)
testNativeSetCaching(mondrian.rolap.VirtualCubeTest)java.lang.NullPointerExc
eption
     [java] 838)
testBug1778358(mondrian.rolap.VirtualCubeTest)java.lang.NullPointerException
     [java] 839)
testBug1778358a(mondrian.rolap.VirtualCubeTest)java.lang.NullPointerExceptio
n
     [java] 840)
testVirtualCubeMeasureCaption(mondrian.rolap.VirtualCubeTest)java.lang.NullP
ointerException
     [java] 841)
testFoo(mondrian.test.ParameterTest)java.lang.NullPointerException
     [java] 842)
testChangeable(mondrian.test.ParameterTest)java.lang.NullPointerException
     [java] 843)
testParameterInFormatString(mondrian.test.ParameterTest)java.lang.NullPointe
rException
     [java] 844)
testParameterInFormatString_Bug1584439(mondrian.test.ParameterTest)java.lang
.NullPointerException
     [java] 845)
testParameterOnAxis(mondrian.test.ParameterTest)java.lang.NullPointerExcepti
on
     [java] 846)
testNumericParameter(mondrian.test.ParameterTest)java.lang.NullPointerExcept
ion
     [java] 847)
testStringParameter(mondrian.test.ParameterTest)java.lang.NullPointerExcepti
on
     [java] 848)
testParameterDimension(mondrian.test.ParameterTest)java.lang.NullPointerExce
ption
     [java] 849)
testParameterHierarchy(mondrian.test.ParameterTest)java.lang.NullPointerExce
ption
     [java] 850)
testParameterLevel(mondrian.test.ParameterTest)java.lang.NullPointerExceptio
n
     [java] 851)
testParameterInSlicer(mondrian.test.ParameterTest)java.lang.NullPointerExcep
tion
     [java] 852)
testParamCyclicOk(mondrian.test.ParameterTest)java.lang.NullPointerException
     [java] 853)
testParameterMetadata(mondrian.test.ParameterTest)java.lang.NullPointerExcep
tion
     [java] 854)
testTwoParametersBug1425153(mondrian.test.ParameterTest)java.lang.NullPointe
rException
     [java] 855)
testConnectionPropsWhichShouldBeNull(mondrian.test.ParameterTest)java.lang.N
ullPointerException
     [java] 856)
testConnectionPropsCannotBeOverridden(mondrian.test.ParameterTest)java.lang.
NullPointerException
     [java] 857)
testSystemPropsGet(mondrian.test.ParameterTest)java.lang.NullPointerExceptio
n
     [java] 858)
testSystemPropsGetJava(mondrian.test.ParameterTest)java.lang.NullPointerExce
ption
     [java] 859)
testMondrianPropsGetJava(mondrian.test.ParameterTest)java.lang.NullPointerEx
ception
     [java] 860)
testSystemPropsSet(mondrian.test.ParameterTest)java.lang.NullPointerExceptio
n
     [java] 861)
testSchemaProp(mondrian.test.ParameterTest)java.lang.NullPointerException
     [java] 862)
testSchemaPropContext(mondrian.test.ParameterTest)java.lang.NullPointerExcep
tion
     [java] 863)
testGrantDimensionNone(mondrian.test.AccessControlTest)java.lang.NullPointer
Exception
     [java] 864)
testRoleMemberAccess(mondrian.test.AccessControlTest)java.lang.NullPointerEx
ception
     [java] 865)
testGrantHierarchy1a(mondrian.test.AccessControlTest)java.lang.NullPointerEx
ception
     [java] 866)
testGrantHierarchy1aAllMembers(mondrian.test.AccessControlTest)java.lang.Nul
lPointerException
     [java] 867)
testGrantHierarchy1b(mondrian.test.AccessControlTest)java.lang.NullPointerEx
ception
     [java] 868)
testGrantHierarchy1c(mondrian.test.AccessControlTest)java.lang.NullPointerEx
ception
     [java] 869)
testGrantHierarchy2(mondrian.test.AccessControlTest)java.lang.NullPointerExc
eption
     [java] 870)
testGrantHierarchy3(mondrian.test.AccessControlTest)java.lang.NullPointerExc
eption
     [java] 871)
testGrantHierarchy4(mondrian.test.AccessControlTest)java.lang.NullPointerExc
eption
     [java] 872)
testGrantHierarchy5(mondrian.test.AccessControlTest)java.lang.NullPointerExc
eption
     [java] 873)
testGrantHierarchy6(mondrian.test.AccessControlTest)java.lang.NullPointerExc
eption
     [java] 874)
testGrantHierarchy7(mondrian.test.AccessControlTest)java.lang.NullPointerExc
eption
     [java] 875)
testGrantHierarchy8(mondrian.test.AccessControlTest)java.lang.NullPointerExc
eption
     [java] 876)
testGrantHierarchy8AllMembers(mondrian.test.AccessControlTest)java.lang.Null
PointerException
     [java] 877)
testGrantHierarchy9(mondrian.test.AccessControlTest)java.lang.NullPointerExc
eption
     [java] 878)
testGrantHierarchyA(mondrian.test.AccessControlTest)java.lang.NullPointerExc
eption
     [java] 879)
testRollupPolicyBasic(mondrian.test.AccessControlTest)java.lang.NullPointerE
xception
     [java] 880)
testRollupPolicyAll(mondrian.test.AccessControlTest)java.lang.NullPointerExc
eption
     [java] 881)
testRollupPolicyAllAsDefault(mondrian.test.AccessControlTest)java.lang.NullP
ointerException
     [java] 882)
testRollupPolicyAllAsParent(mondrian.test.AccessControlTest)java.lang.NullPo
interException
     [java] 883)
testRollupBottomLevel(mondrian.test.AccessControlTest)java.lang.NullPointerE
xception
     [java] 884)
testRollupPolicyGreatGrandchildInvisible(mondrian.test.AccessControlTest)jav
a.lang.NullPointerException
     [java] 885)
testRollupPolicySimultaneous(mondrian.test.AccessControlTest)java.lang.NullP
ointerException
     [java] 886)
testUnionRole(mondrian.test.AccessControlTest)java.lang.NullPointerException
     [java] 887)
testUnparse(mondrian.olap.ParserTest)java.lang.NullPointerException
     [java] 888)
testCloneQuery(mondrian.olap.ParserTest)java.lang.NullPointerException
     [java] 889)
testAll(mondrian.test.ParentChildHierarchyTest)java.lang.NullPointerExceptio
n
     [java] 890)
testFoo(mondrian.test.ParentChildHierarchyTest)java.lang.NullPointerExceptio
n
     [java] 891)
testSnowflakeClosure(mondrian.test.ParentChildHierarchyTest)java.lang.NullPo
interException
     [java] 892)
testSharedClosureParentChildHierarchy(mondrian.test.ParentChildHierarchyTest
)java.lang.NullPointerException
     [java] 893)
testChildrenOfAll(mondrian.test.ParentChildHierarchyTest)java.lang.NullPoint
erException
     [java] 894)
testDistinctAll(mondrian.test.ParentChildHierarchyTest)java.lang.NullPointer
Exception
     [java] 895)
testDistinctChildrenOfAll(mondrian.test.ParentChildHierarchyTest)java.lang.N
ullPointerException
     [java] 896)
testDistinctSubtree(mondrian.test.ParentChildHierarchyTest)java.lang.NullPoi
nterException
     [java] 897)
testDistinctAllExplicitClosure(mondrian.test.ParentChildHierarchyTest)java.l
ang.NullPointerException
     [java] 898)
testDistinctChildrenOfAllExplicitClosure(mondrian.test.ParentChildHierarchyT
est)java.lang.NullPointerException
     [java] 899)
testDistinctSubtreeExplicitClosure(mondrian.test.ParentChildHierarchyTest)ja
va.lang.NullPointerException
     [java] 900)
testLeaf(mondrian.test.ParentChildHierarchyTest)java.lang.NullPointerExcepti
on
     [java] 901)
testOneAboveLeaf(mondrian.test.ParentChildHierarchyTest)java.lang.NullPointe
rException
     [java] 902)
testBar(mondrian.test.ParentChildHierarchyTest)java.lang.NullPointerExceptio
n
     [java] 903)
testHierarchyFalseCycle(mondrian.test.ParentChildHierarchyTest)java.lang.Nul
lPointerException
     [java] 904)
testGenuineCycle(mondrian.test.ParentChildHierarchyTest)java.lang.NullPointe
rException
     [java] 905)
testParentChildDrillThrough(mondrian.test.ParentChildHierarchyTest)java.lang
.NullPointerException
     [java] 906)
testParentChildDrillThroughWithContext(mondrian.test.ParentChildHierarchyTes
t)java.lang.NullPointerException
     [java] 907)
testBug1459995(mondrian.test.ParentChildHierarchyTest)java.lang.NullPointerE
xception
     [java] 908)
testParentChildOrdinal(mondrian.test.ParentChildHierarchyTest)java.lang.Null
PointerException
     [java] 909)
testLevelMembers(mondrian.test.ParentChildHierarchyTest)java.lang.NullPointe
rException
     [java] 910)
testDBCatalogs(mondrian.xmla.XmlaBasicTest)mondrian.xmla.XmlaException:
Mondrian Error:XMLA Discover unparse results error
     [java] 911)
testDBSchemata(mondrian.xmla.XmlaBasicTest)mondrian.xmla.XmlaException:
Mondrian Error:XMLA Discover unparse results error
     [java] 912)
testDBTables(mondrian.xmla.XmlaBasicTest)mondrian.xmla.XmlaException:
Mondrian Error:XMLA Discover unparse results error
     [java] 913)
testMDCubes(mondrian.xmla.XmlaBasicTest)mondrian.xmla.XmlaException:
Mondrian Error:XMLA Discover unparse results error
     [java] 914)
testMDSets(mondrian.xmla.XmlaBasicTest)mondrian.xmla.XmlaException: Mondrian
Error:XMLA Discover unparse results error
     [java] 915)
testMDimensions(mondrian.xmla.XmlaBasicTest)mondrian.xmla.XmlaException:
Mondrian Error:XMLA Discover unparse results error
     [java] 916)
testMDFunction(mondrian.xmla.XmlaBasicTest)mondrian.xmla.XmlaException:
Mondrian Error:XMLA Discover unparse results error
     [java] 917)
testMDFunctions(mondrian.xmla.XmlaBasicTest)mondrian.xmla.XmlaException:
Mondrian Error:XMLA Discover unparse results error
     [java] 918)
testMDHierarchies(mondrian.xmla.XmlaBasicTest)mondrian.xmla.XmlaException:
Mondrian Error:XMLA Discover unparse results error
     [java] 919)
testMDLevels(mondrian.xmla.XmlaBasicTest)mondrian.xmla.XmlaException:
Mondrian Error:XMLA Discover unparse results error
     [java] 920)
testMDLevelsAccessControlled(mondrian.xmla.XmlaBasicTest)mondrian.xmla.XmlaE
xception: Mondrian Error:XMLA Discover unparse results error
     [java] 921)
testMDMeasures(mondrian.xmla.XmlaBasicTest)mondrian.xmla.XmlaException:
Mondrian Error:XMLA Discover unparse results error
     [java] 922)
testMDMembers(mondrian.xmla.XmlaBasicTest)mondrian.xmla.XmlaException:
Mondrian Error:XMLA Discover unparse results error
     [java] 923)
testMDProperties(mondrian.xmla.XmlaBasicTest)mondrian.xmla.XmlaException:
Mondrian Error:XMLA Discover unparse results error
     [java] 924)
testApproxRowCountOverridesCountCallsToDatabase(mondrian.xmla.XmlaBasicTest)
mondrian.xmla.XmlaException: Mondrian Error:XMLA Discover unparse results
error
     [java] 925)
testApproxRowCountInHierarchyOverridesCountCallsToDatabase(mondrian.xmla.Xml
aBasicTest)mondrian.xmla.XmlaException: Mondrian Error:XMLA Discover unparse
results error
     [java] 926)
testExecuteSlicer(mondrian.xmla.XmlaBasicTest)java.lang.NullPointerException
     [java] 927)
testExecuteWithoutCellProperties(mondrian.xmla.XmlaBasicTest)java.lang.NullP
ointerException
     [java] 928)
testExecuteWithCellProperties(mondrian.xmla.XmlaBasicTest)java.lang.NullPoin
terException
     [java] 929)
testExecuteWithMemberKeyDimensionPropertyForMemberWithoutKey(mondrian.xmla.X
mlaBasicTest)java.lang.NullPointerException
     [java] 930)
testExecuteWithMemberKeyDimensionPropertyForMemberWithKey(mondrian.xmla.Xmla
BasicTest)java.lang.NullPointerException
     [java] 931)
testExecuteWithMemberKeyDimensionPropertyForAllMember(mondrian.xmla.XmlaBasi
cTest)java.lang.NullPointerException
     [java] 932)
testExecuteWithKeyDimensionProperty(mondrian.xmla.XmlaBasicTest)java.lang.Nu
llPointerException
     [java] 933)
testExecuteWithDimensionProperties(mondrian.xmla.XmlaBasicTest)java.lang.Nul
lPointerException
     [java] 934)
testExecuteCrossjoin(mondrian.xmla.XmlaBasicTest)java.lang.NullPointerExcept
ion
     [java] 935)
testExecuteCrossjoinRole(mondrian.xmla.XmlaBasicTest)java.lang.NullPointerEx
ception
     [java] 936)
testCellProperties(mondrian.xmla.XmlaCognosTest)java.lang.NullPointerExcepti
on
     [java] 937)
testDimensionPropertyForPercentageIssue(mondrian.xmla.XmlaCognosTest)java.la
ng.NullPointerException
     [java] 938)
testNegativeSolveOrder(mondrian.xmla.XmlaCognosTest)java.lang.NullPointerExc
eption
     [java] 939)
testNonEmptyWithCognosCalcOneLiteral(mondrian.xmla.XmlaCognosTest)java.lang.
NullPointerException
     [java] 940)
testCrossJoin(mondrian.xmla.XmlaCognosTest)java.lang.NullPointerException
     [java] 941)
testWithFilterOn3rdAxis(mondrian.xmla.XmlaCognosTest)java.lang.NullPointerEx
ception
     [java] 942)
testWithSorting(mondrian.xmla.XmlaCognosTest)java.lang.NullPointerException
     [java] 943)
testWithFilter(mondrian.xmla.XmlaCognosTest)java.lang.NullPointerException
     [java] 944)
testWithAggregation(mondrian.xmla.XmlaCognosTest)java.lang.NullPointerExcept
ion
     [java] 945)
testTabularOneByOne(mondrian.xmla.XmlaTabularTest)java.lang.NullPointerExcep
tion
     [java] 946)
testTabularOneByTwo(mondrian.xmla.XmlaTabularTest)java.lang.NullPointerExcep
tion
     [java] 947)
testTabularTwoByOne(mondrian.xmla.XmlaTabularTest)java.lang.NullPointerExcep
tion
     [java] 948)
testTabularTwoByTwo(mondrian.xmla.XmlaTabularTest)java.lang.NullPointerExcep
tion
     [java] 949)
testTabularZeroByZero(mondrian.xmla.XmlaTabularTest)java.lang.NullPointerExc
eption
     [java] 950)
testTabularVoid(mondrian.xmla.XmlaTabularTest)java.lang.NullPointerException
     [java] 951)
testTabularThreeAxes(mondrian.xmla.XmlaTabularTest)java.lang.NullPointerExce
ption
     [java] 952)
dbschemaCatalogs(mondrian.xmla.test.XmlaTest)mondrian.xmla.XmlaException:
Mondrian Error:XMLA Discover unparse results error
     [java] 953)
executeHR-tabular(mondrian.xmla.test.XmlaTest)java.lang.NullPointerException
     [java] 954)
executeHR(mondrian.xmla.test.XmlaTest)java.lang.NullPointerException
     [java] 955)
mdschemaCubesRestrictions(mondrian.xmla.test.XmlaTest)mondrian.xmla.XmlaExce
ption: Mondrian Error:XMLA Discover unparse results error
     [java] 956)
mdschemaCubes(mondrian.xmla.test.XmlaTest)mondrian.xmla.XmlaException:
Mondrian Error:XMLA Discover unparse results error
     [java] 957)
mdschemaDimensionsCubeDimRestrictions(mondrian.xmla.test.XmlaTest)mondrian.x
mla.XmlaException: Mondrian Error:XMLA Discover unparse results error
     [java] 958)
mdschemaDimensionsCubeRestrictions(mondrian.xmla.test.XmlaTest)mondrian.xmla
.XmlaException: Mondrian Error:XMLA Discover unparse results error
     [java] 959)
mdschemaHierarchiesCubeDimRestrictions(mondrian.xmla.test.XmlaTest)mondrian.
xmla.XmlaException: Mondrian Error:XMLA Discover unparse results error
     [java] 960)
mdschemaHierarchiesCubeRestrictions(mondrian.xmla.test.XmlaTest)mondrian.xml
a.XmlaException: Mondrian Error:XMLA Discover unparse results error
     [java] 961)
mdschemaLevelsCubeDimRestrictions(mondrian.xmla.test.XmlaTest)mondrian.xmla.
XmlaException: Mondrian Error:XMLA Discover unparse results error
     [java] 962)
mdschemaMeasuresCubeRestrictions(mondrian.xmla.test.XmlaTest)mondrian.xmla.X
mlaException: Mondrian Error:XMLA Discover unparse results error
     [java] 963)
mdschemaMeasuresCubeLvlRestrictions(mondrian.xmla.test.XmlaTest)mondrian.xml
a.XmlaException: Mondrian Error:XMLA Discover unparse results error
     [java] 964)
mdschemaMembersCubeMeasureRestrictions2(mondrian.xmla.test.XmlaTest)mondrian
.xmla.XmlaException: Mondrian Error:XMLA Discover unparse results error
     [java] 965)
mdschemaMembersCubeMeasureRestrictions3(mondrian.xmla.test.XmlaTest)mondrian
.xmla.XmlaException: Mondrian Error:XMLA Discover unparse results error
     [java] 966)
mdschemaMembersCubeMeasureRestrictions(mondrian.xmla.test.XmlaTest)mondrian.
xmla.XmlaException: Mondrian Error:XMLA Discover unparse results error
     [java] 967)
testNegativeSolveOrder(mondrian.test.TestCalculatedMembers)java.lang.NullPoi
nterException
     [java] 968)
testCalculatedMemberInCube(mondrian.test.TestCalculatedMembers)java.lang.Nul
lPointerException
     [java] 969)
testCalculatedMemberInCubeViaApi(mondrian.test.TestCalculatedMembers)java.la
ng.NullPointerException
     [java] 970)
testCalculatedMemberInCubeWithSpace(mondrian.test.TestCalculatedMembers)java
.lang.NullPointerException
     [java] 971)
testCalculatedMemberInCubeWithProps(mondrian.test.TestCalculatedMembers)java
.lang.NullPointerException
     [java] 972)
testCalculatedMemberInCubeAndQuery(mondrian.test.TestCalculatedMembers)java.
lang.NullPointerException
     [java] 973)
testQueryCalculatedMemberOverridesCube(mondrian.test.TestCalculatedMembers)j
ava.lang.NullPointerException
     [java] 974)
testCalculatedMemberCaption(mondrian.test.TestCalculatedMembers)java.lang.Nu
llPointerException
     [java] 975)
testBracketInCalcMemberName(mondrian.test.TestCalculatedMembers)java.lang.Nu
llPointerException
     [java] 976)
testNpeInIif(mondrian.test.TestCalculatedMembers)java.lang.NullPointerExcept
ion
     [java] 977)
testPropertyReferencesCalcMember(mondrian.test.TestCalculatedMembers)java.la
ng.NullPointerException
     [java] 978)
testQuoteInCalcMember(mondrian.test.TestCalculatedMembers)java.lang.NullPoin
terException
     [java] 979)
testChildrenOfCalcMembers(mondrian.test.TestCalculatedMembers)java.lang.Null
PointerException
     [java] 980)
testNonCharacterMembers(mondrian.test.TestCalculatedMembers)java.lang.NullPo
interException
     [java] 981)
testFormatString(mondrian.test.TestCalculatedMembers)java.lang.NullPointerEx
ception
     [java] 982)
testCalcMemberCustomFormatterInQuery(mondrian.test.TestCalculatedMembers)jav
a.lang.NullPointerException
     [java] 983)
testCalcMemberCustomFormatterInNonMeasureInQuery(mondrian.test.TestCalculate
dMembers)java.lang.NullPointerException
     [java] 984)
testCalcMemberCustomFormatterInSchema(mondrian.test.TestCalculatedMembers)ja
va.lang.NullPointerException
     [java] 985)
testStrToSetInCubeCalcMember(mondrian.test.TestCalculatedMembers)java.lang.N
ullPointerException
     [java] 986)
testCreateCalculatedMember(mondrian.test.TestCalculatedMembers)java.lang.Nul
lPointerException
     [java] 987)
testSetIncludesSelf(mondrian.test.TestCalculatedMembers)java.lang.NullPointe
rException
     [java] 988)
testLead(mondrian.test.RaggedHierarchyTest)java.lang.NullPointerException
     [java] 989)
testHierarchize(mondrian.test.RaggedHierarchyTest)java.lang.NullPointerExcep
tion
     [java] 990)
testChildrenOfRoot(mondrian.test.RaggedHierarchyTest)java.lang.NullPointerEx
ception
     [java] 991)
testChildrenOfUSA(mondrian.test.RaggedHierarchyTest)java.lang.NullPointerExc
eption
     [java] 992)
testChildrenOfIsrael(mondrian.test.RaggedHierarchyTest)java.lang.NullPointer
Exception
     [java] 993)
testParentOfHaifa(mondrian.test.RaggedHierarchyTest)java.lang.NullPointerExc
eption
     [java] 994)
testParentOfVatican(mondrian.test.RaggedHierarchyTest)java.lang.NullPointerE
xception
     [java] 995)
testPrevMemberOfHaifa(mondrian.test.RaggedHierarchyTest)java.lang.NullPointe
rException
     [java] 996)
testNextMemberOfTelAviv(mondrian.test.RaggedHierarchyTest)java.lang.NullPoin
terException
     [java] 997)
testNextMemberOfBC(mondrian.test.RaggedHierarchyTest)java.lang.NullPointerEx
ception
     [java] 998)
testDescendantsOfVaticanAtStateLevel(mondrian.test.RaggedHierarchyTest)java.
lang.NullPointerException
     [java] 999)
testDescendantsOfRootAtCity(mondrian.test.RaggedHierarchyTest)java.lang.Null
PointerException
     [java] 1000)
testAncestorOfHaifa(mondrian.test.RaggedHierarchyTest)java.lang.NullPointerE
xception
     [java] 1001)
testNonEmptyForAllAxesWithPropertySet(mondrian.rolap.NonEmptyPropertyForAllA
xisTest)java.lang.NullPointerException
     [java] 1002)
testNonEmptyForAllAxesWithOutPropertySet(mondrian.rolap.NonEmptyPropertyForA
llAxisTest)java.lang.NullPointerException
     [java] 1003)
testInlineTable(mondrian.test.InlineTableTest)java.lang.NullPointerException
     [java] 1004)
testInlineTableInSharedDim(mondrian.test.InlineTableTest)java.lang.NullPoint
erException
     [java] 1005)
testCubeCase(mondrian.test.CompatibilityTest)java.lang.NullPointerException
     [java] 1006)
testCubeBrackets(mondrian.test.CompatibilityTest)java.lang.NullPointerExcept
ion
     [java] 1007)
testReservedWord(mondrian.test.CompatibilityTest)java.lang.NullPointerExcept
ion
     [java] 1008)
testDimensionCase(mondrian.test.CompatibilityTest)java.lang.NullPointerExcep
tion
     [java] 1009)
testDimensionBrackets(mondrian.test.CompatibilityTest)java.lang.NullPointerE
xception
     [java] 1010)
testMemberCase(mondrian.test.CompatibilityTest)java.lang.NullPointerExceptio
n
     [java] 1011)
testCalculatedMemberCase(mondrian.test.CompatibilityTest)java.lang.NullPoint
erException
     [java] 1012)
testSolveOrderCase(mondrian.test.CompatibilityTest)java.lang.NullPointerExce
ption
     [java] 1013)
testMemberBrackets(mondrian.test.CompatibilityTest)java.lang.NullPointerExce
ption
     [java] 1014)
testHierarchyNames(mondrian.test.CompatibilityTest)java.lang.NullPointerExce
ption
     [java] 1015)
testCaseInsensitiveNullMember(mondrian.test.CompatibilityTest)java.lang.Null
PointerException
     [java] 1016)
testNullNameColumn(mondrian.test.CompatibilityTest)java.lang.NullPointerExce
ption
     [java] 1017)
testNullCollation(mondrian.test.CompatibilityTest)java.lang.NullPointerExcep
tion
     [java] 1018)
testPropertyCaseSensitivity(mondrian.test.CompatibilityTest)java.lang.NullPo
interException
     [java] 1019)
testMeasureCaption(mondrian.test.CaptionTest)java.lang.NullPointerException
     [java] 1020)
testDimCaption(mondrian.test.CaptionTest)java.lang.NullPointerException
     [java] 1021)
testDimCaptionShared(mondrian.test.CaptionTest)java.lang.NullPointerExceptio
n
     [java] 1022)
testSanity(mondrian.test.UdfTest)java.lang.NullPointerException
     [java] 1023)
testFun(mondrian.test.UdfTest)java.lang.NullPointerException
     [java] 1024)
testLastNonEmpty(mondrian.test.UdfTest)java.lang.NullPointerException
     [java] 1025)
testLastNonEmptyBig(mondrian.test.UdfTest)java.lang.NullPointerException
     [java] 1026)
testComplexFun(mondrian.test.UdfTest)java.lang.NullPointerException
     [java] 1027)
testException(mondrian.test.UdfTest)java.lang.NullPointerException
     [java] 1028)
testCurrentDateString(mondrian.test.UdfTest)java.lang.NullPointerException
     [java] 1029)
testCurrentDateMemberBefore(mondrian.test.UdfTest)java.lang.NullPointerExcep
tion
     [java] 1030)
testCurrentDateMemberBeforeUsingQuotes(mondrian.test.UdfTest)java.lang.NullP
ointerException
     [java] 1031)
testCurrentDateMemberAfter(mondrian.test.UdfTest)java.lang.NullPointerExcept
ion
     [java] 1032)
testCurrentDateMemberExact(mondrian.test.UdfTest)java.lang.NullPointerExcept
ion
     [java] 1033)
testCurrentDateMemberNoFindArg(mondrian.test.UdfTest)java.lang.NullPointerEx
ception
     [java] 1034)
testCurrentDateMemberHierarchy(mondrian.test.UdfTest)java.lang.NullPointerEx
ception
     [java] 1035)
testCurrentDateMemberHierarchyNullReturn(mondrian.test.UdfTest)java.lang.Nul
lPointerException
     [java] 1036)
testCurrentDateMemberRealAfter(mondrian.test.UdfTest)java.lang.NullPointerEx
ception
     [java] 1037)
testCurrentDateMemberRealExact1(mondrian.test.UdfTest)java.lang.NullPointerE
xception
     [java] 1038)
testCurrentDateMemberRealExact2(mondrian.test.UdfTest)java.lang.NullPointerE
xception
     [java] 1039)
testCurrentDateMemberPrev(mondrian.test.UdfTest)java.lang.NullPointerExcepti
on
     [java] 1040)
testCurrentDateLag(mondrian.test.UdfTest)java.lang.NullPointerException
     [java] 1041)
testMatches(mondrian.test.UdfTest)java.lang.NullPointerException
     [java] 1042)
testNotMatches(mondrian.test.UdfTest)java.lang.NullPointerException
     [java] 1043)
testIn(mondrian.test.UdfTest)java.lang.NullPointerException
     [java] 1044)
testNotIn(mondrian.test.UdfTest)java.lang.NullPointerException
     [java] 1045)
testChildMemberIn(mondrian.test.UdfTest)java.lang.NullPointerException
     [java] 1046)
testNonGuessableReturnType(mondrian.test.UdfTest)java.lang.NullPointerExcept
ion
     [java] 1047)
testAnotherMemberFun(mondrian.test.UdfTest)java.lang.NullPointerException
     [java] 1048)
testCachingCurrentDate(mondrian.test.UdfTest)java.lang.NullPointerException
     [java] 1049)
testNullValue(mondrian.udf.NullValueTest)java.lang.NullPointerException
     [java] 1050)
testGenerate(mondrian.test.NamedSetTest)java.lang.NullPointerException
     [java] 1051)
testNamedSet(mondrian.test.NamedSetTest)java.lang.NullPointerException
     [java] 1052)
testNamedSetOnMember(mondrian.test.NamedSetTest)java.lang.NullPointerExcepti
on
     [java] 1053)
testNamedSetAsList(mondrian.test.NamedSetTest)java.lang.NullPointerException
     [java] 1054)
testNamedSetCrossJoin(mondrian.test.NamedSetTest)java.lang.NullPointerExcept
ion
     [java] 1055)
testNamedSetUsedInCrossJoin(mondrian.test.NamedSetTest)java.lang.NullPointer
Exception
     [java] 1056)
testAggOnCalcMember(mondrian.test.NamedSetTest)java.lang.NullPointerExceptio
n
     [java] 1057)
testContextSensitiveNamedSet(mondrian.test.NamedSetTest)java.lang.NullPointe
rException
     [java] 1058)
testOrderedNamedSet(mondrian.test.NamedSetTest)java.lang.NullPointerExceptio
n
     [java] 1059)
testNamedSetAgainstCube(mondrian.test.NamedSetTest)java.lang.NullPointerExce
ption
     [java] 1060)
testNamedSetAgainstSchema(mondrian.test.NamedSetTest)java.lang.NullPointerEx
ception
     [java] 1061)
testNamedSetsMixedWithCalcMembers(mondrian.test.NamedSetTest)java.lang.NullP
ointerException
     [java] 1062)
testNamedSetAndUnion(mondrian.test.NamedSetTest)java.lang.NullPointerExcepti
on
     [java] 1063)
testNamedSetDependencies(mondrian.test.NamedSetTest)java.lang.NullPointerExc
eption
     [java] 1064)
testMandatoryMemberProperties(mondrian.test.PropertiesTest)java.lang.NullPoi
nterException
     [java] 1065)
testGetChildCardinalityPropertyValue(mondrian.test.PropertiesTest)java.lang.
NullPointerException
     [java] 1066)
testPropertiesMDX(mondrian.test.PropertiesTest)java.lang.NullPointerExceptio
n
     [java] 1067)
testMandatoryCellProperties(mondrian.test.PropertiesTest)java.lang.NullPoint
erException
     [java] 1068)
testWeekly(mondrian.test.MultipleHierarchyTest)java.lang.NullPointerExceptio
n
     [java] 1069)
testWeekly2(mondrian.test.MultipleHierarchyTest)java.lang.NullPointerExcepti
on
     [java] 1070)
testCalcMember(mondrian.test.MultipleHierarchyTest)java.lang.NullPointerExce
ption
     [java] 1071)
testProperty(mondrian.test.MultipleHierarchyTest)java.lang.NullPointerExcept
ion
     [java] 1072)
testAutoFrench(mondrian.test.I18nTest)java.lang.NullPointerException
     [java] 1073)
testAutoSpanish(mondrian.test.I18nTest)java.lang.NullPointerException
     [java] 1074)
testAutoMexican(mondrian.test.I18nTest)java.lang.NullPointerException
     [java] 1075)
testUnionRole(mondrian.test.SchemaTest)java.lang.NullPointerException
     [java] 1076)
testSolveOrderInCalculatedMember(mondrian.test.SchemaTest)java.lang.NullPoin
terException
     [java] 1077)
testHierarchyDefaultMember(mondrian.test.SchemaTest)java.lang.NullPointerExc
eption
     [java] 1078)
testHierarchyAbbreviatedDefaultMember(mondrian.test.SchemaTest)java.lang.Nul
lPointerException
     [java] 1079)
testDuplicateTableAlias(mondrian.test.SchemaTest)java.lang.NullPointerExcept
ion
     [java] 1080)
testDuplicateTableAliasSameForeignKey(mondrian.test.SchemaTest)java.lang.Nul
lPointerException
     [java] 1081)
testDimensionsShareTable(mondrian.test.SchemaTest)java.lang.NullPointerExcep
tion
     [java] 1082)
testDimensionsShareTableSameForeignKeys(mondrian.test.SchemaTest)java.lang.N
ullPointerException
     [java] 1083)
testDimensionsShareJoinTable(mondrian.test.SchemaTest)java.lang.NullPointerE
xception
     [java] 1084)
testDimensionsShareJoinTableOneAlias(mondrian.test.SchemaTest)java.lang.Null
PointerException
     [java] 1085)
testDimensionsShareJoinTableTwoAliases(mondrian.test.SchemaTest)java.lang.Nu
llPointerException
     [java] 1086)
testTwoAliasesDimensionsShareTable(mondrian.test.SchemaTest)java.lang.NullPo
interException
     [java] 1087)
testTwoAliasesDimensionsShareTableSameForeignKeys(mondrian.test.SchemaTest)j
ava.lang.NullPointerException
     [java] 1088)
testMultipleDimensionUsages(mondrian.test.SchemaTest)java.lang.NullPointerEx
ception
     [java] 1089)
testDimensionCreation(mondrian.test.SchemaTest)java.lang.NullPointerExceptio
n
     [java] 1090)
testDimensionUsageLevel(mondrian.test.SchemaTest)java.lang.NullPointerExcept
ion
     [java] 1091)
testAllMemberMultipleDimensionUsages(mondrian.test.SchemaTest)java.lang.Null
PointerException
     [java] 1092)
testViewFactTable(mondrian.test.SchemaTest)java.lang.NullPointerException
     [java] 1093)
testViewFactTable2(mondrian.test.SchemaTest)java.lang.NullPointerException
     [java] 1094)
testDeprecatedDistinctCountAggregator(mondrian.test.SchemaTest)java.lang.Nul
lPointerException
     [java] 1095)
testBug1578545(mondrian.test.SchemaTest)java.lang.NullPointerException
     [java] 1096)
testBug1746362(mondrian.test.SchemaTest)java.lang.NullPointerException
     [java] 1097)
testCubeWithOneDimensionOneMeasure(mondrian.test.SchemaTest)java.lang.NullPo
interException
     [java] 1098)
testCubeWithOneDimensionUsageOneMeasure(mondrian.test.SchemaTest)java.lang.N
ullPointerException
     [java] 1099)
testCubeWithNoDimensions(mondrian.test.SchemaTest)java.lang.NullPointerExcep
tion
     [java] 1100)
testLevelTableAttributeAsView(mondrian.test.SchemaTest)java.lang.NullPointer
Exception
     [java] 1101)
testGroupingSetForSingleColumnConstraint(mondrian.rolap.GroupingSetQueryTest
)java.lang.NullPointerException
     [java] 1102)
testNotUsingGroupingSetWhenGroupUsesDifferentAggregateTable(mondrian.rolap.G
roupingSetQueryTest)java.lang.NullPointerException
     [java] 1103)
testNotUsingGroupingSet(mondrian.rolap.GroupingSetQueryTest)java.lang.NullPo
interException
     [java] 1104)
testGroupingSetForMultipleMeasureAndSingleConstraint(mondrian.rolap.Grouping
SetQueryTest)java.lang.NullPointerException
     [java] 1105)
testGroupingSetForASummaryCanBeGroupedWith2DetailBatch(mondrian.rolap.Groupi
ngSetQueryTest)java.lang.NullPointerException
     [java] 1106)
testGroupingSetForMultipleColumnConstraint(mondrian.rolap.GroupingSetQueryTe
st)java.lang.NullPointerException
     [java] 1107)
testGroupingSetForMultipleColumnConstraintAndCompoundConstraint(mondrian.rol
ap.GroupingSetQueryTest)java.lang.NullPointerException
     [java] 1108)
testDataSourceChangeListenerPlugin(mondrian.rolap.DataSourceChangeListenerTe
st)java.lang.NullPointerException
     [java] 1109)
testParallelDataSourceChangeListenerPlugin(mondrian.rolap.DataSourceChangeLi
stenerTest)java.lang.NullPointerException
     [java] 1110)
testCellLookup(mondrian.rolap.CellKeyTest)java.lang.NullPointerException
     [java] 1111)
testAll(mondrian.rolap.RolapResultTest)java.lang.NullPointerException
     [java] 1112)
testD1(mondrian.rolap.RolapResultTest)java.lang.NullPointerException
     [java] 1113)
testD2(mondrian.rolap.RolapResultTest)java.lang.NullPointerException
     [java] 1114)
testNonAllPromotionMembers(mondrian.rolap.RolapResultTest)java.lang.NullPoin
terException
     [java] 1115)
testVirtualCube(mondrian.rolap.SharedDimensionTest)java.lang.NullPointerExce
ption
     [java] 1116)
testStoreCube(mondrian.rolap.SharedDimensionTest)java.lang.NullPointerExcept
ion
     [java] 1117)
testA(mondrian.rolap.SharedDimensionTest)java.lang.NullPointerException
     [java] 1118)
testB(mondrian.rolap.SharedDimensionTest)java.lang.NullPointerException
     [java] 1119)
testNECJMemberList(mondrian.rolap.SharedDimensionTest)java.lang.NullPointerE
xception
     [java] 1120)
testNECJMultiLevelMemberList(mondrian.rolap.SharedDimensionTest)java.lang.Nu
llPointerException
     [java] 1121)
testSF1711865(mondrian.rolap.SharedDimensionTest)java.lang.NullPointerExcept
ion
     [java] 1122)
testHasCellPropertyWhenQueryHasCellProperties(mondrian.olap.QueryTest)java.l
ang.NullPointerException
     [java] 1123)
testIsCellPropertyEmpty(mondrian.olap.QueryTest)java.lang.NullPointerExcepti
on
     [java] 1124)
testGetCubesWithNoHrCubes(mondrian.rolap.RolapSchemaReaderTest)java.lang.Nul
lPointerException
     [java] 1125)
testGetCubesWithNoRole(mondrian.rolap.RolapSchemaReaderTest)java.lang.NullPo
interException
     [java] 1126)
testGetCubesForCaliforniaManager(mondrian.rolap.RolapSchemaReaderTest)java.l
ang.NullPointerException
     [java] 1127)
testProcessFormatStringAttributeToIgnoreNullFormatString(mondrian.rolap.Rola
pCubeTest)java.lang.NullPointerException
     [java] 1128)
testProcessFormatStringAttribute(mondrian.rolap.RolapCubeTest)java.lang.Null
PointerException
     [java] 1129)
testGetCalculatedMembersWithNoRole(mondrian.rolap.RolapCubeTest)java.lang.Nu
llPointerException
     [java] 1130)
testGetCalculatedMembersForCaliforniaManager(mondrian.rolap.RolapCubeTest)ja
va.lang.NullPointerException
     [java] 1131)
testGetCalculatedMembersReturnsOnlyAccessibleMembers(mondrian.rolap.RolapCub
eTest)java.lang.NullPointerException
     [java] 1132)
testGetCalculatedMembersReturnsOnlyAccessibleMembersForHierarchy(mondrian.ro
lap.RolapCubeTest)java.lang.NullPointerException
     [java] 1133)
testGetCalculatedMembersReturnsOnlyAccessibleMembersForLevel(mondrian.rolap.
RolapCubeTest)java.lang.NullPointerException
     [java] 1134)
testClosingPeriodMemberLeafWithCustomNullRepresentation(mondrian.olap.NullMe
mberRepresentationTest)java.lang.NullPointerException
     [java] 1135)
testItemMemberWithCustomNullMemberRepresentation(mondrian.olap.NullMemberRep
resentationTest)java.lang.NullPointerException
     [java] 1136)
testNullMemberWithCustomRepresentation(mondrian.olap.NullMemberRepresentatio
nTest)java.lang.NullPointerException
     [java] 1137)
testTotalingOnCrossJoinOfJoiningAndNonJoiningDimensions(mondrian.test.Ignore
UnrelatedDimensionsTest)java.lang.NullPointerException
     [java] 1138)
testVMShouldNotPushUpAggregateMemberDefinedOnNonJoiningDimension(mondrian.te
st.IgnoreUnrelatedDimensionsTest)java.lang.NullPointerException
     [java] 1139)
testAggregateMemberDefinedOnNonJoiningDimensionWithNonAllDefaultMember(mondr
ian.test.IgnoreUnrelatedDimensionsTest)java.lang.NullPointerException
     [java] 1140)
testTotalingForValidAndNonValidMeasuresWithJoiningDimensions(mondrian.test.I
gnoreUnrelatedDimensionsTest)java.lang.NullPointerException
     [java] 1141)
testTotalingWhenIgnoreUnrelatedDimensionsPropertyIsTrue(mondrian.test.Ignore
UnrelatedDimensionsTest)java.lang.NullPointerException
     [java] 1142)
testTotalingOnNonJoiningDimension(mondrian.test.IgnoreUnrelatedDimensionsTes
t)java.lang.NullPointerException
     [java] 1143)
testToStringForSingleGroupingSetSql(mondrian.rolap.sql.SqlQueryTest)java.lan
g.NullPointerException
     [java] 1144)
testPredicatesAreOptimizedWhenPropertyIsTrue(mondrian.rolap.sql.SqlQueryTest
)java.lang.NullPointerException
     [java] 1145)
testPredicatesAreNotOptimizedWhenPropertyIsFalse(mondrian.rolap.sql.SqlQuery
Test)java.lang.NullPointerException
     [java] 1146)
testPredicatesAreOptimizedWhenAllTheMembersAreIncluded(mondrian.rolap.sql.Sq
lQueryTest)java.lang.NullPointerException
     [java] 1147)
testToStringForGroupingSetSqlWithEmptyGroup(mondrian.rolap.sql.SqlQueryTest)
java.lang.NullPointerException
     [java] 1148)
testToStringForMultipleGroupingSetsSql(mondrian.rolap.sql.SqlQueryTest)java.
lang.NullPointerException
     [java] 1149)
testDoubleInList(mondrian.rolap.sql.SqlQueryTest)java.lang.NullPointerExcept
ion
     [java] 1)
testBadComments(mondrian.test.BasicQueryTest)junit.framework.AssertionFailed
Error: query's error does not match pattern 'Failed to parse query'; error
is [java.lang.NullPointerException
     [java] 2)
testCompoundSlicerFails(mondrian.test.BasicQueryTest)junit.framework.Asserti
onFailedError: query's error does not match pattern 'WHERE clause expression
returned set with more than one element.'; error is
[java.lang.NullPointerException
     [java] 3)
testScalarOnAxisFails(mondrian.test.BasicQueryTest)junit.framework.Assertion
FailedError: query's error does not match pattern 'Axis 'COLUMNS' expression
is not a set'; error is [java.lang.NullPointerException
     [java] 4)
testSameDimOnTwoAxesFails(mondrian.test.BasicQueryTest)junit.framework.Asser
tionFailedError: query's error does not match pattern 'Dimension
'[Measures]' appears in more than one independent axis'; error is
[java.lang.NullPointerException
     [java] 5)
testBadMeasure1(mondrian.test.BasicQueryTest)junit.framework.AssertionFailed
Error: query's error does not match pattern 'must contain either a source
column or a source expression, but not both'; error is
[java.lang.NullPointerException
     [java] 6)
testBadMeasure2(mondrian.test.BasicQueryTest)junit.framework.AssertionFailed
Error: query's error does not match pattern 'must contain either a source
column or a source expression, but not both'; error is
[java.lang.NullPointerException
     [java] 7)
testInvalidMembersInQuery(mondrian.test.BasicQueryTest)junit.framework.Asser
tionFailedError: query's error does not match pattern 'MDX object
'[Time].[1997].[QTOO]' not found in cube 'Sales''; error is
[java.lang.NullPointerException
     [java] 8)
testQueryTimeout(mondrian.test.BasicQueryTest)junit.framework.AssertionFaile
dError: query's error does not match pattern 'Query timeout of 2 seconds
reached'; error is [java.lang.NullPointerException
     [java] 9)
testQueryIterationLimit(mondrian.test.BasicQueryTest)junit.framework.Asserti
onFailedError: query's error does not match pattern 'Number of iterations
exceeded limit of 11'; error is [java.lang.NullPointerException
     [java] 10)
testDuplicateAxisFails(mondrian.test.BasicQueryTest)junit.framework.Assertio
nFailedError: query's error does not match pattern 'Duplicate axis name
'COLUMNS'.'; error is [java.lang.NullPointerException
     [java] 11)
testInvalidAxisFails(mondrian.test.BasicQueryTest)junit.framework.AssertionF
ailedError: query's error does not match pattern 'Invalid axis
specification. The axis number must be an integer between 0 and 5, but it
was 10.'; error is [java.lang.NullPointerException
     [java] 12)
testLevelsTooSmall(mondrian.olap.fun.FunctionTest)junit.framework.AssertionF
ailedError: query's error does not match pattern 'Index '-1' out of bounds';
error is [java.lang.NullPointerException
     [java] 13)
testLevelsTooLarge(mondrian.olap.fun.FunctionTest)junit.framework.AssertionF
ailedError: query's error does not match pattern 'Index '8' out of bounds';
error is [java.lang.NullPointerException
     [java] 14)
testLevelsStringFail(mondrian.olap.fun.FunctionTest)junit.framework.Assertio
nFailedError: query's error does not match pattern 'Level 'nonexistent' not
found'; error is [java.lang.NullPointerException
     [java] 15)
testIIfWithStringAndNull(mondrian.olap.fun.FunctionTest)junit.framework.Asse
rtionFailedError: query's error does not match pattern 'Failed to parse';
error is [java.lang.NullPointerException
     [java] 16)
testPropertiesNonExistent(mondrian.olap.fun.FunctionTest)junit.framework.Ass
ertionFailedError: query's error does not match pattern 'Property 'Foo' is
not valid for'; error is [java.lang.NullPointerException
     [java] 17)
testIsString(mondrian.olap.fun.FunctionTest)junit.framework.AssertionFailedE
rror: query's error does not match pattern 'No function matches signature
'<String> IS <String>''; error is [java.lang.NullPointerException
     [java] 18)
testIsNumeric(mondrian.olap.fun.FunctionTest)junit.framework.AssertionFailed
Error: query's error does not match pattern 'No function matches signature
'<Numeric Expression> IS <Numeric Expression>''; error is
[java.lang.NullPointerException
     [java] 19)
testToggleDrillStateRecursive(mondrian.olap.fun.FunctionTest)junit.framework
.AssertionFailedError: query's error does not match pattern ''RECURSIVE' is
not supported in ToggleDrillState.'; error is
[java.lang.NullPointerException
     [java] 20)
testLeftFunctionWithNegativeLength(mondrian.olap.fun.FunctionTest)junit.fram
ework.AssertionFailedError: query's error does not match pattern 'Invalid
parameter. Length parameter of Left function can't be negative'; error is
[java.lang.NullPointerException
     [java] 21)
testMidFunctionWithNegativeStartIndex(mondrian.olap.fun.FunctionTest)junit.f
ramework.AssertionFailedError: query's error does not match pattern 'Invalid
parameter. Start parameter of Mid function can't be negative'; error is
[java.lang.NullPointerException
     [java] 22)
testMidFunctionWithNegativeLength(mondrian.olap.fun.FunctionTest)junit.frame
work.AssertionFailedError: query's error does not match pattern 'Invalid
parameter. Length parameter of Mid function can't be negative'; error is
[java.lang.NullPointerException
     [java] 23)
testNumericParameterStringValueFails(mondrian.test.ParameterTest)junit.frame
work.AssertionFailedError: query's error does not match pattern 'Default
value of parameter 'S' is inconsistent with its type, NUMERIC'; error is
[java.lang.NullPointerException
     [java] 24)
testParameterMemberFails(mondrian.test.ParameterTest)junit.framework.Asserti
onFailedError: query's error does not match pattern 'Invalid type for
parameter 'Foo'; expecting NUMERIC, STRING or a hierarchy'; error is
[java.lang.NullPointerException
     [java] 25)
testParameterWithExpressionForHierarchyFails(mondrian.test.ParameterTest)jun
it.framework.AssertionFailedError: query's error does not match pattern
'Invalid parameter 'Foo'. Type must be a NUMERIC, STRING, or a dimension,
hierarchy or level'; error is [java.lang.NullPointerException
     [java] 26)
testParamRefWithoutParamFails(mondrian.test.ParameterTest)junit.framework.As
sertionFailedError: query's error does not match pattern 'Unknown parameter
'Y''; error is [java.lang.NullPointerException
     [java] 27)
testParamDefinedTwiceFails(mondrian.test.ParameterTest)junit.framework.Asser
tionFailedError: query's error does not match pattern 'Parameter 'P' is
defined more than once'; error is [java.lang.NullPointerException
     [java] 28)
testParamBadTypeFails(mondrian.test.ParameterTest)junit.framework.AssertionF
ailedError: query's error does not match pattern 'No function matches
signature 'Parameter(<String>, <Numeric Expression>)''; error is
[java.lang.NullPointerException
     [java] 29)
testParamCyclicFails(mondrian.test.ParameterTest)junit.framework.AssertionFa
iledError: query's error does not match pattern 'Cycle occurred while
evaluating parameter 'P''; error is [java.lang.NullPointerException
     [java] 30)
testSchemaPropDupFails(mondrian.test.ParameterTest)junit.framework.Assertion
FailedError: query's error does not match pattern 'Duplicate parameter 'foo'
in schema'; error is [java.lang.NullPointerException
     [java] 31)
testSchemaPropIllegalTypeFails(mondrian.test.ParameterTest)junit.framework.A
ssertionFailedError: query's error does not match pattern 'In Schema: In
Parameter: Value 'Bad type' of attribute 'type' has illegal value 'Bad
type'.  Legal values: {String, Numeric, Integer, Boolean, Date, Time,
Timestamp, Member}'; error is [java.lang.NullPointerException
     [java] 32)
testSchemaPropInvalidDefaultExpFails(mondrian.test.ParameterTest)junit.frame
work.AssertionFailedError: query's error does not match pattern 'No function
matches signature '<Member>.Children(<Numeric Expression>)''; error is
[java.lang.NullPointerException
     [java] 33)
testNoAccessToCube(mondrian.test.AccessControlTest)junit.framework.Assertion
FailedError: query's error does not match pattern 'MDX cube 'HR' not found';
error is [java.lang.NullPointerException
     [java] 34)
testRollupPolicyNegative(mondrian.test.AccessControlTest)junit.framework.Ass
ertionFailedError: query's error does not match pattern 'Illegal
rollupPolicy value 'bad''; error is [java.lang.NullPointerException
     [java] 35)
test03(mondrian.xmla.XmlaExcel2000Test)junit.framework.AssertionFailedError:
org.custommonkey.xmlunit.Diff
     [java] 36)
test08(mondrian.xmla.XmlaExcel2000Test)junit.framework.AssertionFailedError:
org.custommonkey.xmlunit.Diff
     [java] 37)
test09(mondrian.xmla.XmlaExcel2000Test)junit.framework.AssertionFailedError:
org.custommonkey.xmlunit.Diff
     [java] 38)
test10(mondrian.xmla.XmlaExcel2000Test)junit.framework.AssertionFailedError:
org.custommonkey.xmlunit.Diff
     [java] 39)
test11(mondrian.xmla.XmlaExcel2000Test)junit.framework.AssertionFailedError:
org.custommonkey.xmlunit.Diff
     [java] 40)
test12(mondrian.xmla.XmlaExcel2000Test)junit.framework.AssertionFailedError:
org.custommonkey.xmlunit.Diff
     [java] 41)
test13(mondrian.xmla.XmlaExcel2000Test)junit.framework.AssertionFailedError:
org.custommonkey.xmlunit.Diff
     [java] 42)
test14(mondrian.xmla.XmlaExcel2000Test)junit.framework.AssertionFailedError:
org.custommonkey.xmlunit.Diff
     [java] 43)
test15(mondrian.xmla.XmlaExcel2000Test)junit.framework.AssertionFailedError:
org.custommonkey.xmlunit.Diff
     [java] 44)
test16(mondrian.xmla.XmlaExcel2000Test)junit.framework.AssertionFailedError:
org.custommonkey.xmlunit.Diff
     [java] 45)
test17(mondrian.xmla.XmlaExcel2000Test)junit.framework.AssertionFailedError:
org.custommonkey.xmlunit.Diff
     [java] 46)
testExpect03(mondrian.xmla.XmlaExcel2000Test)junit.framework.AssertionFailed
Error: org.custommonkey.xmlunit.Diff
     [java] 47)
test03(mondrian.xmla.XmlaExcelXPTest)junit.framework.AssertionFailedError:
org.custommonkey.xmlunit.Diff
     [java] 48)
test08(mondrian.xmla.XmlaExcelXPTest)junit.framework.AssertionFailedError:
org.custommonkey.xmlunit.Diff
     [java] 49)
test09(mondrian.xmla.XmlaExcelXPTest)junit.framework.AssertionFailedError:
org.custommonkey.xmlunit.Diff
     [java] 50)
test10(mondrian.xmla.XmlaExcelXPTest)junit.framework.AssertionFailedError:
org.custommonkey.xmlunit.Diff
     [java] 51)
test11(mondrian.xmla.XmlaExcelXPTest)junit.framework.AssertionFailedError:
org.custommonkey.xmlunit.Diff
     [java] 52)
test12(mondrian.xmla.XmlaExcelXPTest)junit.framework.AssertionFailedError:
org.custommonkey.xmlunit.Diff
     [java] 53)
test13(mondrian.xmla.XmlaExcelXPTest)junit.framework.AssertionFailedError:
org.custommonkey.xmlunit.Diff
     [java] 54)
test14(mondrian.xmla.XmlaExcelXPTest)junit.framework.AssertionFailedError:
org.custommonkey.xmlunit.Diff
     [java] 55)
test15(mondrian.xmla.XmlaExcelXPTest)junit.framework.AssertionFailedError:
org.custommonkey.xmlunit.Diff
     [java] 56)
test16(mondrian.xmla.XmlaExcelXPTest)junit.framework.AssertionFailedError:
org.custommonkey.xmlunit.Diff
     [java] 57)
test17(mondrian.xmla.XmlaExcelXPTest)junit.framework.AssertionFailedError:
org.custommonkey.xmlunit.Diff
     [java] 58)
testExpect03(mondrian.xmla.XmlaExcelXPTest)junit.framework.AssertionFailedEr
ror: org.custommonkey.xmlunit.Diff
     [java] 59)
test19(mondrian.xmla.XmlaExcelXPTest)junit.framework.AssertionFailedError:
org.custommonkey.xmlunit.Diff
     [java] 60)
test20(mondrian.xmla.XmlaExcelXPTest)junit.framework.AssertionFailedError:
org.custommonkey.xmlunit.Diff
     [java] 61)
test24(mondrian.xmla.XmlaExcelXPTest)junit.framework.AssertionFailedError:
org.custommonkey.xmlunit.Diff
     [java] 62)
testCalcMemberIsSetFails(mondrian.test.TestCalculatedMembers)junit.framework
.AssertionFailedError: query's error does not match pattern 'Member
expression 'Filter([Product].Members, (1.0 <> 0.0))' must not be a set';
error is [java.lang.NullPointerException
     [java] 63)
testBracketInCubeCalcMemberName(mondrian.test.TestCalculatedMembers)junit.fr
amework.AssertionFailedError: query's error does not match pattern 'Syntax
error at line 1, column 38, token 'inside''; error is
[java.lang.NullPointerException
     [java] 64)
testCalcMemberWithQuote(mondrian.test.TestCalculatedMembers)junit.framework.
AssertionFailedError: query's error does not match pattern 'Syntax error at
line 1, column 57, token 'apostrophe''; error is
[java.lang.NullPointerException
     [java] 65)
testCalcMemberCustomFormatterInQueryNegative(mondrian.test.TestCalculatedMem
bers)junit.framework.AssertionFailedError: query's error does not match
pattern 'Failed to load formatter class
'mondrian.test.NonExistentCellFormatter' for member '[Measures].[Foo]'.';
error is [java.lang.NullPointerException
     [java] 66)
testCalcMemberCustomFormatterInQueryNegative2(mondrian.test.TestCalculatedMe
mbers)junit.framework.AssertionFailedError: query's error does not match
pattern 'Failed to load formatter class 'java.lang.String' for member
'[Measures].[Foo]'.'; error is [java.lang.NullPointerException
     [java] 67)
testCalcMemberCustomFormatterInSchemaNegative(mondrian.test.TestCalculatedMe
mbers)junit.framework.AssertionFailedError: query's error does not match
pattern 'Failed to load formatter class
'mondrian.test.NonExistentCellFormatter' for member '[Measures].[Profit
Formatted]'.'; error is [java.lang.NullPointerException
     [java] 68)
testBadFun(mondrian.test.UdfTest)junit.framework.ComparisonFailure:
expected:<Mondrian Error:Internal error: Invalid user-defined function
'BadPlusOne': return type is null> but was:<null>
     [java] 69)
testBadNamedSet(mondrian.test.NamedSetTest)junit.framework.AssertionFailedEr
ror: query's error does not match pattern 'Named set 'Bad' has bad formula';
error is [java.lang.NullPointerException
     [java] 70)
testNamedSetMustBeSet(mondrian.test.NamedSetTest)junit.framework.AssertionFa
iledError: query's error does not match pattern 'Set expression '[Foo]' must
be a set'; error is [java.lang.NullPointerException
     [java] 71)
testMultipleSlicersFails(mondrian.test.MultipleHierarchyTest)junit.framework
.AssertionFailedError: query's error does not match pattern 'Tuple contains
more than one member of dimension '[Time]'.'; error is
[java.lang.NullPointerException
     [java] 72)
testHierarchyBadDefaultMember(mondrian.test.SchemaTest)junit.framework.Asser
tionFailedError: query's error does not match pattern 'Can not find Default
Member with name "[Gender with default].[Non].[Existent]" in Hierarchy
"Gender with default"'; error is [java.lang.NullPointerException
     [java] 73)
testNonAliasedDimensionUsage(mondrian.test.SchemaTest)junit.framework.Assert
ionFailedError: query's error does not match pattern 'In cube "Sales Two
Dimensions" use of unaliased Dimension name "[Time]" rather than the alias
name "Time2"'; error is [java.lang.NullPointerException
     [java] 74)
testInvalidAggregator(mondrian.test.SchemaTest)junit.framework.AssertionFail
edError: query's error does not match pattern 'Unknown aggregator
'invalidAggregator'; valid aggregators are: 'sum', 'count', 'min', 'max',
'avg', 'distinct-count''; error is [java.lang.NullPointerException
     [java] 75)
testCubeWithNoMeasuresFails(mondrian.test.SchemaTest)junit.framework.Asserti
onFailedError: query's error does not match pattern 'Hierarchy '[Measures]'
is invalid (has no members)'; error is [java.lang.NullPointerException
     [java] 76)
testCubeWithOneCalcMeasure(mondrian.test.SchemaTest)junit.framework.Assertio
nFailedError: query's error does not match pattern 'Hierarchy '[Measures]'
is invalid (has no members)'; error is [java.lang.NullPointerException
     [java] 77)
testInvalidSchemaAccess(mondrian.test.SchemaTest)junit.framework.AssertionFa
iledError: query's error does not match pattern 'In Schema: In Role: In
SchemaGrant: Value 'invalid' of attribute 'access' has illegal value
'invalid'.  Legal values: {all, custom, none, all_dimensions}'; error is
[java.lang.NullPointerException
     [java] 78)
testUnionRoleContainsGrants(mondrian.test.SchemaTest)junit.framework.Asserti
onFailedError: query's error does not match pattern 'Union role must not
contain grants'; error is [java.lang.NullPointerException
     [java] 79)
testUnionRoleIllegalForwardRef(mondrian.test.SchemaTest)junit.framework.Asse
rtionFailedError: query's error does not match pattern 'Unknown role
'Role2''; error is [java.lang.NullPointerException
     [java] 80)
testQuery(mondrian.test.CmdRunnerTest)junit.framework.ComparisonFailure:
expected:<Axis #0:
     [java] 81)
test7731(mondrian.test.CmdRunnerTest)junit.framework.ComparisonFailure:
expected:<Axis #0:
     [java] 82)
warning(junit.framework.TestSuite$1)junit.framework.AssertionFailedError:
Exception in constructor:
testShouldUseGroupingFunctionOnPropertyTrueAndOnSupportedDB
(java.lang.NullPointerException
     [java] 83)
warning(junit.framework.TestSuite$1)junit.framework.AssertionFailedError:
Exception in constructor:
testShouldUseGroupingFunctionOnPropertyTrueAndOnNonSupportedDB
(java.lang.NullPointerException
     [java] 84)
warning(junit.framework.TestSuite$1)junit.framework.AssertionFailedError:
Exception in constructor:
testShouldUseGroupingFunctionOnPropertyFalseOnSupportedDB
(java.lang.NullPointerException
     [java] 85)
warning(junit.framework.TestSuite$1)junit.framework.AssertionFailedError:
Exception in constructor:
testShouldUseGroupingFunctionOnPropertyFalseOnNonSupportedDB
(java.lang.NullPointerException
     [java] 86)
warning(junit.framework.TestSuite$1)junit.framework.AssertionFailedError:
Exception in constructor: testDoesDBSupportGroupingSets
(java.lang.NullPointerException
     [java] 87)
warning(junit.framework.TestSuite$1)junit.framework.AssertionFailedError:
Exception in constructor: testGroupBatchesForNonGroupableBatchesWithSorting
(java.lang.NullPointerException
     [java] 88)
warning(junit.framework.TestSuite$1)junit.framework.AssertionFailedError:
Exception in constructor:
testGroupBatchesForNonGroupableBatchesWithConstraints
(java.lang.NullPointerException
     [java] 89)
warning(junit.framework.TestSuite$1)junit.framework.AssertionFailedError:
Exception in constructor: testGroupBatchesForGroupableBatches
(java.lang.NullPointerException
     [java] 90)
warning(junit.framework.TestSuite$1)junit.framework.AssertionFailedError:
Exception in constructor:
testGroupBatchesForGroupableBatchesAndNonGroupableBatches
(java.lang.NullPointerException
     [java] 91)
warning(junit.framework.TestSuite$1)junit.framework.AssertionFailedError:
Exception in constructor: testGroupBatchesForTwoSetOfGroupableBatches
(java.lang.NullPointerException
     [java] 92)
warning(junit.framework.TestSuite$1)junit.framework.AssertionFailedError:
Exception in constructor:
testAddToCompositeBatchForBothBatchesNotPartOfCompositeBatch
(java.lang.NullPointerException
     [java] 93)
warning(junit.framework.TestSuite$1)junit.framework.AssertionFailedError:
Exception in constructor:
testAddToCompositeBatchForDetailedBatchAlreadyPartOfACompositeBatch
(java.lang.NullPointerException
     [java] 94)
warning(junit.framework.TestSuite$1)junit.framework.AssertionFailedError:
Exception in constructor:
testAddToCompositeBatchForAggregationBatchAlreadyPartOfACompositeBatch
(java.lang.NullPointerException
     [java] 95)
warning(junit.framework.TestSuite$1)junit.framework.AssertionFailedError:
Exception in constructor:
testAddToCompositeBatchForBothBatchAlreadyPartOfACompositeBatch
(java.lang.NullPointerException
     [java] 96)
warning(junit.framework.TestSuite$1)junit.framework.AssertionFailedError:
Exception in constructor:
testCanBatchForBatchWithSuperSetOfContraintColumnBitKeyAndAllValuesForAdditi
onalCondition (java.lang.NullPointerException
     [java] 97)
warning(junit.framework.TestSuite$1)junit.framework.AssertionFailedError:
Exception in constructor: testCanBatchForBatchWithConstraint
(java.lang.NullPointerException
     [java] 98)
warning(junit.framework.TestSuite$1)junit.framework.AssertionFailedError:
Exception in constructor: testCanBatchForBatchWithConstraint2
(java.lang.NullPointerException
     [java] 99)
warning(junit.framework.TestSuite$1)junit.framework.AssertionFailedError:
Exception in constructor:
testCanBatchForBatchWithDistinctCountInDetailedBatch
(java.lang.NullPointerException
     [java] 100)
warning(junit.framework.TestSuite$1)junit.framework.AssertionFailedError:
Exception in constructor:
testCanBatchForBatchWithDistinctCountInAggregateBatch
(java.lang.NullPointerException
     [java] 101)
warning(junit.framework.TestSuite$1)junit.framework.AssertionFailedError:
Exception in constructor:
testCanBatchForBatchWithNonSuperSetOfContraintColumnBitKeyAndAllValuesForAdd
itionalCondition (java.lang.NullPointerException
     [java] 102)
warning(junit.framework.TestSuite$1)junit.framework.AssertionFailedError:
Exception in constructor:
testCanBatchForBatchWithSuperSetOfContraintColumnBitKeyAndNOTAllValuesForAdd
itionalCondition (java.lang.NullPointerException
     [java] 103)
warning(junit.framework.TestSuite$1)junit.framework.AssertionFailedError:
Exception in constructor:
testCanBatchForBatchesFromSameAggregationButDifferentRollupOption
(java.lang.NullPointerException
     [java] 104)
warning(junit.framework.TestSuite$1)junit.framework.AssertionFailedError:
Exception in constructor:
testCanBatchForBatchWithSuperSetOfContraintColumnBitKeyAndDifferentValuesFor
OverlappingColumns (java.lang.NullPointerException
     [java] 105)
warning(junit.framework.TestSuite$1)junit.framework.AssertionFailedError:
Exception in constructor: testCanBatchForBatchWithDifferentAggregationTable
(java.lang.NullPointerException
     [java] 106)
warning(junit.framework.TestSuite$1)junit.framework.AssertionFailedError:
Exception in constructor: testCompositeBatchLoadAggregation
(java.lang.NullPointerException
     [java] 107)
warning(junit.framework.TestSuite$1)junit.framework.AssertionFailedError:
Exception in constructor: testLoadDistinctSqlMeasure
(java.lang.NullPointerException
     [java] 108)
warning(junit.framework.TestSuite$1)junit.framework.AssertionFailedError:
Exception in constructor: testAggregateDistinctCount
(java.lang.NullPointerException
     [java] 109)
warning(junit.framework.TestSuite$1)junit.framework.AssertionFailedError:
Exception in constructor: testAggregateDistinctCount2
(java.lang.NullPointerException
     [java] 110)
warning(junit.framework.TestSuite$1)junit.framework.AssertionFailedError:
Exception in constructor: testAggregateDistinctCount3
(java.lang.NullPointerException
     [java] 111)
warning(junit.framework.TestSuite$1)junit.framework.AssertionFailedError:
Exception in constructor: testAggregateDistinctCount4
(java.lang.NullPointerException
     [java] 112)
warning(junit.framework.TestSuite$1)junit.framework.AssertionFailedError:
Exception in constructor: testAggregateDistinctCount5
(java.lang.NullPointerException
     [java] 113)
warning(junit.framework.TestSuite$1)junit.framework.AssertionFailedError:
Exception in constructor: testDistinctCountBug1785406
(java.lang.NullPointerException
     [java] 114)
warning(junit.framework.TestSuite$1)junit.framework.AssertionFailedError:
Exception in constructor: testDistinctCountBug1785406_2
(java.lang.NullPointerException
     [java] 115)
warning(junit.framework.TestSuite$1)junit.framework.AssertionFailedError:
Exception in constructor: testAggregateDistinctCountInDimensionFilter
(java.lang.NullPointerException
     [java] Tests run: 1470,  Failures: 115,  Errors: 1149
Running test with JDK=jdk1.6 retroweave= database=oracle props={
mondrian.rolap.aggregates.Use=true mondrian.rolap.aggregates.Read=true
mondrian.rolap.aggregates.ChooseByVolume=true
mondrian.rolap.star.disableCaching=true mondrian.native.filter.enable=false
mondrian.native.nonempty.enable=false
mondrian.xmla.drillthroughTotalCount.enable=false
mondrian.olap.fun.crossjoin.optimizer.size=0
mondrian.rolap.groupingsets.enable=true}
     [java] 1)
testMultipleDimensionUsages(mondrian.test.SchemaTest)mondrian.olap.MondrianE
xception: Mondrian Error:Too many errors, '1', while loading/reloadin
aggregates.
     [java] 2)
testParallelDataSourceChangeListenerPlugin(mondrian.rolap.DataSourceChangeLi
stenerTest)java.lang.OutOfMemoryError: GC overhead limit exceeded
     [java] 	at
mondrian.rolap.aggmatcher.DefaultRules.columnsOK(DefaultRules.java:447)
     [java] 3)
testCellLookup(mondrian.rolap.CellKeyTest)java.lang.OutOfMemoryError: GC
overhead limit exceeded
     [java] 4)
testAll(mondrian.rolap.RolapResultTest)java.lang.OutOfMemoryError: GC
overhead limit exceeded
     [java] 5)
testD1(mondrian.rolap.RolapResultTest)java.lang.OutOfMemoryError: GC
overhead limit exceeded
     [java] 6)
testD2(mondrian.rolap.RolapResultTest)java.lang.OutOfMemoryError: GC
overhead limit exceeded
     [java] 7)
testNonAllPromotionMembers(mondrian.rolap.RolapResultTest)java.lang.OutOfMem
oryError: GC overhead limit exceeded
     [java] 8)
testVirtualCube(mondrian.rolap.SharedDimensionTest)java.lang.OutOfMemoryErro
r: GC overhead limit exceeded
     [java] 9)
testStoreCube(mondrian.rolap.SharedDimensionTest)java.lang.OutOfMemoryError:
GC overhead limit exceeded
     [java] 10)
testA(mondrian.rolap.SharedDimensionTest)java.lang.OutOfMemoryError: GC
overhead limit exceeded
     [java] 11)
testB(mondrian.rolap.SharedDimensionTest)java.lang.OutOfMemoryError: GC
overhead limit exceeded
     [java] 12)
testNECJMemberList(mondrian.rolap.SharedDimensionTest)java.lang.OutOfMemoryE
rror: GC overhead limit exceeded
     [java] 13)
testNECJMultiLevelMemberList(mondrian.rolap.SharedDimensionTest)java.lang.Ou
tOfMemoryError: GC overhead limit exceeded
     [java] 14)
testSF1711865(mondrian.rolap.SharedDimensionTest)java.lang.OutOfMemoryError:
GC overhead limit exceeded
     [java] 15)
testGetCubesWithNoHrCubes(mondrian.rolap.RolapSchemaReaderTest)java.lang.Out
OfMemoryError: GC overhead limit exceeded
     [java] 16)
testGetCubesForCaliforniaManager(mondrian.rolap.RolapSchemaReaderTest)java.l
ang.OutOfMemoryError: GC overhead limit exceeded
     [java] 17)
testGetCalculatedMembersForCaliforniaManager(mondrian.rolap.RolapCubeTest)ja
va.lang.OutOfMemoryError: GC overhead limit exceeded
     [java] 18)
testGetCalculatedMembersReturnsOnlyAccessibleMembers(mondrian.rolap.RolapCub
eTest)java.lang.OutOfMemoryError: GC overhead limit exceeded
     [java] 19)
testGetCalculatedMembersReturnsOnlyAccessibleMembersForHierarchy(mondrian.ro
lap.RolapCubeTest)java.lang.OutOfMemoryError: GC overhead limit exceeded
     [java] 20)
testGetCalculatedMembersReturnsOnlyAccessibleMembersForLevel(mondrian.rolap.
RolapCubeTest)java.lang.OutOfMemoryError: GC overhead limit exceeded
     [java] 21)
testTotalingOnCrossJoinOfJoiningAndNonJoiningDimensions(mondrian.test.Ignore
UnrelatedDimensionsTest)java.lang.OutOfMemoryError: GC overhead limit
exceeded
     [java] 22)
testVMShouldNotPushUpAggregateMemberDefinedOnNonJoiningDimension(mondrian.te
st.IgnoreUnrelatedDimensionsTest)java.lang.OutOfMemoryError: GC overhead
limit exceeded
     [java] 23)
testAggregateMemberDefinedOnNonJoiningDimensionWithNonAllDefaultMember(mondr
ian.test.IgnoreUnrelatedDimensionsTest)java.lang.OutOfMemoryError: GC
overhead limit exceeded
     [java] 24)
testTotalingForValidAndNonValidMeasuresWithJoiningDimensions(mondrian.test.I
gnoreUnrelatedDimensionsTest)java.lang.OutOfMemoryError: GC overhead limit
exceeded
     [java] 25)
testTotalingWhenIgnoreUnrelatedDimensionsPropertyIsTrue(mondrian.test.Ignore
UnrelatedDimensionsTest)java.lang.OutOfMemoryError: GC overhead limit
exceeded
     [java] 26)
testTotalingOnNonJoiningDimension(mondrian.test.IgnoreUnrelatedDimensionsTes
t)java.lang.OutOfMemoryError: GC overhead limit exceeded
     [java] 27)
testDoesDBSupportGroupingSets(mondrian.rolap.FastBatchingCellReaderTest)java
.lang.OutOfMemoryError: GC overhead limit exceeded
     [java] 28)
testGroupBatchesForNonGroupableBatchesWithSorting(mondrian.rolap.FastBatchin
gCellReaderTest)java.lang.OutOfMemoryError: GC overhead limit exceeded
     [java] 29)
testGroupBatchesForNonGroupableBatchesWithConstraints(mondrian.rolap.FastBat
chingCellReaderTest)java.lang.OutOfMemoryError: GC overhead limit exceeded
     [java] 30)
testGroupBatchesForGroupableBatches(mondrian.rolap.FastBatchingCellReaderTes
t)java.lang.OutOfMemoryError: GC overhead limit exceeded
     [java] 31)
testGroupBatchesForGroupableBatchesAndNonGroupableBatches(mondrian.rolap.Fas
tBatchingCellReaderTest)java.lang.OutOfMemoryError: GC overhead limit
exceeded
     [java] 32)
testGroupBatchesForTwoSetOfGroupableBatches(mondrian.rolap.FastBatchingCellR
eaderTest)java.lang.OutOfMemoryError: GC overhead limit exceeded
     [java] 33)
testAddToCompositeBatchForBothBatchesNotPartOfCompositeBatch(mondrian.rolap.
FastBatchingCellReaderTest)java.lang.OutOfMemoryError: GC overhead limit
exceeded
     [java] 34)
testAddToCompositeBatchForDetailedBatchAlreadyPartOfACompositeBatch(mondrian
.rolap.FastBatchingCellReaderTest)java.lang.OutOfMemoryError: GC overhead
limit exceeded
     [java] 35)
testAddToCompositeBatchForAggregationBatchAlreadyPartOfACompositeBatch(mondr
ian.rolap.FastBatchingCellReaderTest)java.lang.OutOfMemoryError: GC overhead
limit exceeded
     [java] 36)
testAddToCompositeBatchForBothBatchAlreadyPartOfACompositeBatch(mondrian.rol
ap.FastBatchingCellReaderTest)java.lang.OutOfMemoryError: GC overhead limit
exceeded
     [java] 37)
testCanBatchForBatchWithSuperSetOfContraintColumnBitKeyAndAllValuesForAdditi
onalCondition(mondrian.rolap.FastBatchingCellReaderTest)java.lang.OutOfMemor
yError: GC overhead limit exceeded
     [java] 38)
testCanBatchForBatchWithConstraint(mondrian.rolap.FastBatchingCellReaderTest
)java.lang.OutOfMemoryError: GC overhead limit exceeded
     [java] 39)
testCanBatchForBatchWithConstraint2(mondrian.rolap.FastBatchingCellReaderTes
t)java.lang.OutOfMemoryError: GC overhead limit exceeded
     [java] 40)
testCanBatchForBatchWithDistinctCountInDetailedBatch(mondrian.rolap.FastBatc
hingCellReaderTest)java.lang.OutOfMemoryError: GC overhead limit exceeded
     [java] 41)
testCanBatchForBatchWithDistinctCountInAggregateBatch(mondrian.rolap.FastBat
chingCellReaderTest)java.lang.OutOfMemoryError: GC overhead limit exceeded
     [java] 42)
testCanBatchForBatchWithNonSuperSetOfContraintColumnBitKeyAndAllValuesForAdd
itionalCondition(mondrian.rolap.FastBatchingCellReaderTest)java.lang.OutOfMe
moryError: GC overhead limit exceeded
     [java] 43)
testCanBatchForBatchWithSuperSetOfContraintColumnBitKeyAndNOTAllValuesForAdd
itionalCondition(mondrian.rolap.FastBatchingCellReaderTest)java.lang.OutOfMe
moryError: GC overhead limit exceeded
     [java] 44)
testCanBatchForBatchesFromSameAggregationButDifferentRollupOption(mondrian.r
olap.FastBatchingCellReaderTest)java.lang.OutOfMemoryError: GC overhead
limit exceeded
     [java] 45)
testCanBatchForBatchWithSuperSetOfContraintColumnBitKeyAndDifferentValuesFor
OverlappingColumns(mondrian.rolap.FastBatchingCellReaderTest)java.lang.OutOf
MemoryError: GC overhead limit exceeded
     [java] 46)
testCanBatchForBatchWithDifferentAggregationTable(mondrian.rolap.FastBatchin
gCellReaderTest)java.lang.OutOfMemoryError: GC overhead limit exceeded
     [java] 47)
testCompositeBatchLoadAggregation(mondrian.rolap.FastBatchingCellReaderTest)
java.lang.OutOfMemoryError: GC overhead limit exceeded
     [java] 48)
testLoadDistinctSqlMeasure(mondrian.rolap.FastBatchingCellReaderTest)java.la
ng.OutOfMemoryError: GC overhead limit exceeded
     [java] 49)
testAggregateDistinctCount(mondrian.rolap.FastBatchingCellReaderTest)java.la
ng.OutOfMemoryError: GC overhead limit exceeded
     [java] 50)
testAggregateDistinctCount2(mondrian.rolap.FastBatchingCellReaderTest)java.l
ang.OutOfMemoryError: GC overhead limit exceeded
     [java] 51)
testAggregateDistinctCount3(mondrian.rolap.FastBatchingCellReaderTest)java.l
ang.OutOfMemoryError: GC overhead limit exceeded
     [java] 52)
testAggregateDistinctCount4(mondrian.rolap.FastBatchingCellReaderTest)java.l
ang.OutOfMemoryError: GC overhead limit exceeded
     [java] 53)
testAggregateDistinctCount5(mondrian.rolap.FastBatchingCellReaderTest)java.l
ang.OutOfMemoryError: GC overhead limit exceeded
     [java] 54)
testDistinctCountBug1785406(mondrian.rolap.FastBatchingCellReaderTest)java.l
ang.OutOfMemoryError: GC overhead limit exceeded
     [java] 55)
testDistinctCountBug1785406_2(mondrian.rolap.FastBatchingCellReaderTest)java
.lang.OutOfMemoryError: GC overhead limit exceeded
     [java] 56)
testAggregateDistinctCountInDimensionFilter(mondrian.rolap.FastBatchingCellR
eaderTest)java.lang.OutOfMemoryError: GC overhead limit exceeded
     [java] 57)
testToStringForSingleGroupingSetSql(mondrian.rolap.sql.SqlQueryTest)java.lan
g.OutOfMemoryError: GC overhead limit exceeded
     [java] 58)
testPredicatesAreOptimizedWhenPropertyIsTrue(mondrian.rolap.sql.SqlQueryTest
)java.lang.OutOfMemoryError: GC overhead limit exceeded
     [java] 59)
testPredicatesAreNotOptimizedWhenPropertyIsFalse(mondrian.rolap.sql.SqlQuery
Test)java.lang.OutOfMemoryError: GC overhead limit exceeded
     [java] 60)
testPredicatesAreOptimizedWhenAllTheMembersAreIncluded(mondrian.rolap.sql.Sq
lQueryTest)java.lang.OutOfMemoryError: GC overhead limit exceeded
     [java] 61)
testToStringForGroupingSetSqlWithEmptyGroup(mondrian.rolap.sql.SqlQueryTest)
java.lang.OutOfMemoryError: GC overhead limit exceeded
     [java] 62)
testToStringForMultipleGroupingSetsSql(mondrian.rolap.sql.SqlQueryTest)java.
lang.OutOfMemoryError: GC overhead limit exceeded
     [java] 63)
testDoubleInList(mondrian.rolap.sql.SqlQueryTest)java.lang.OutOfMemoryError:
GC overhead limit exceeded
     [java] 64)
testBatchedFill1(mondrian.test.clearview.BatchedFillTest)java.lang.OutOfMemo
ryError: GC overhead limit exceeded
     [java] 65)
testBatchedFill2(mondrian.test.clearview.BatchedFillTest)java.lang.OutOfMemo
ryError: GC overhead limit exceeded
     [java] 1)
testUnknownUsages(mondrian.test.SchemaTest)junit.framework.ComparisonFailure
: expected:<......> but was:<...06_sales_fact_1997' for fact table
'sales_fact_1997' has a column 'city' with unknown usage.
     [java] 2)
testUnknownUsages1(mondrian.test.SchemaTest)junit.framework.ComparisonFailur
e: expected:<...> but was:<...WARN - Recognizer.checkUnusedColumns:
Candidate aggregate table 'agg_lc_06_sales_fact_1997' for fact table
'sales_fact_1997' has a column 'city' with unknown usage.
     [java] Tests run: 1472,  Failures: 2,  Errors: 65
Running test with JDK=jdk1.6 retroweave= database=oracle props={
mondrian.test.ExpDependencies=10 mondrian.rolap.evaluate.MaxEvalDepth=6
mondrian.native.crossjoin.enable=false}
     [java] 1)
testRollupPolicySimultaneous(mondrian.test.AccessControlTest)mondrian.olap.M
ondrianException: Mondrian Error:Internal error: Error while executing query
[with member [Measures].[Foo] as '[Measures].[Unit Sales]'
     [java] 1)
testGroupBatchesForTwoSetOfGroupableBatches(mondrian.rolap.FastBatchingCellR
eaderTest)junit.framework.AssertionFailedError: expected:<2> but was:<4>
     [java] 2)
testCanBatchForBatchesFromSameAggregationButDifferentRollupOption(mondrian.r
olap.FastBatchingCellReaderTest)junit.framework.AssertionFailedError
     [java] Tests run: 1470,  Failures: 2,  Errors: 1
Running test with JDK=jdk1.6 retroweave= database=oracle props={
mondrian.rolap.aggregates.Use=true mondrian.rolap.aggregates.Read=true
mondrian.olap.case.sensitive=false mondrian.test.ExpDependencies=10
mondrian.rolap.evaluate.MaxEvalDepth=6
mondrian.xmla.drillthroughTotalCount.enable=false
mondrian.expCache.enable=false
mondrian.rolap.SparseSegmentValueThreshold=25000}
     [java] 1)
testRollupPolicySimultaneous(mondrian.test.AccessControlTest)mondrian.olap.M
ondrianException: Mondrian Error:Internal error: Error while executing query
[with member [Measures].[Foo] as '[Measures].[Unit Sales]'
     [java] 2)
testMultipleDimensionUsages(mondrian.test.SchemaTest)mondrian.olap.MondrianE
xception: Mondrian Error:Too many errors, '1', while loading/reloadin
aggregates.
     [java] 1)
testUnknownUsages(mondrian.test.SchemaTest)junit.framework.ComparisonFailure
: expected:<......> but was:<...06_sales_fact_1997' for fact table
'sales_fact_1997' has a column 'city' with unknown usage.
     [java] 2)
testUnknownUsages1(mondrian.test.SchemaTest)junit.framework.ComparisonFailur
e: expected:<...> but was:<...WARN - Recognizer.checkUnusedColumns:
Candidate aggregate table 'agg_lc_06_sales_fact_1997' for fact table
'sales_fact_1997' has a column 'city' with unknown usage.
     [java] Tests run: 1571,  Failures: 2,  Errors: 2
Running test with JDK=jdk1.4 retroweave=true database=mysql props={
mondrian.test.ExpDependencies=10 mondrian.rolap.evaluate.MaxEvalDepth=6
mondrian.native.crossjoin.enable=false
mondrian.xmla.drillthroughTotalCount.enable=false
mondrian.rolap.LargeDimensionThreshold=1000
mondrian.rolap.SparseSegmentValueThreshold=10}
     [java] 1)
testRollupPolicySimultaneous(mondrian.test.AccessControlTest)mondrian.olap.M
ondrianException: Mondrian Error:Internal error: Error while executing query
[with member [Measures].[Foo] as '[Measures].[Unit Sales]'
     [java] 1)
testFlush(mondrian.rolap.CacheControlTest)junit.framework.ComparisonFailure:
Expected:
     [java] Tests run: 1470,  Failures: 1,  Errors: 1
Running test with JDK=jdk1.5 retroweave= database=oracle props={
mondrian.rolap.aggregates.Use=true mondrian.rolap.aggregates.Read=true
mondrian.rolap.aggregates.ChooseByVolume=true
mondrian.rolap.star.disableCaching=true mondrian.olap.case.sensitive=false
mondrian.test.ExpDependencies=10 mondrian.rolap.evaluate.MaxEvalDepth=6
mondrian.rolap.SparseSegmentValueThreshold=25000}
     [java] 1)
testRollupPolicySimultaneous(mondrian.test.AccessControlTest)mondrian.olap.M
ondrianException: Mondrian Error:Internal error: Error while executing query
[with member [Measures].[Foo] as '[Measures].[Unit Sales]'
     [java] 2)
testMultipleDimensionUsages(mondrian.test.SchemaTest)mondrian.olap.MondrianE
xception: Mondrian Error:Too many errors, '1', while loading/reloadin
aggregates.
     [java] 3)
testCubeWithOneDimensionOneMeasure(mondrian.test.SchemaTest)java.lang.OutOfM
emoryError: Java heap space
     [java] 4)
testCubeWithOneDimensionUsageOneMeasure(mondrian.test.SchemaTest)java.lang.O
utOfMemoryError: Java heap space
     [java] 5)
testCubeWithNoDimensions(mondrian.test.SchemaTest)java.lang.OutOfMemoryError
: Java heap space
     [java] 6)
testNotUsingGroupingSetWhenGroupUsesDifferentAggregateTable(mondrian.rolap.G
roupingSetQueryTest)java.lang.OutOfMemoryError: Java heap space
     [java] 7)
testNotUsingGroupingSet(mondrian.rolap.GroupingSetQueryTest)java.lang.OutOfM
emoryError: Java heap space
     [java] 8)
testGroupingSetForMultipleMeasureAndSingleConstraint(mondrian.rolap.Grouping
SetQueryTest)java.lang.OutOfMemoryError: Java heap space
     [java] 9)
testGroupingSetForASummaryCanBeGroupedWith2DetailBatch(mondrian.rolap.Groupi
ngSetQueryTest)java.lang.OutOfMemoryError: Java heap space
     [java] 10)
testGroupingSetForMultipleColumnConstraint(mondrian.rolap.GroupingSetQueryTe
st)java.lang.OutOfMemoryError: Java heap space
     [java] 11)
testGroupingSetForMultipleColumnConstraintAndCompoundConstraint(mondrian.rol
ap.GroupingSetQueryTest)java.lang.OutOfMemoryError: Java heap space
     [java] 12)
testQuery(mondrian.test.CmdRunnerTest)java.lang.OutOfMemoryError: Java heap
space
     [java] 13)
test7731(mondrian.test.CmdRunnerTest)java.lang.OutOfMemoryError: Java heap
space
     [java] 14)
testParallelDataSourceChangeListenerPlugin(mondrian.rolap.DataSourceChangeLi
stenerTest)java.lang.OutOfMemoryError: Java heap space
     [java] 15)
testCellLookup(mondrian.rolap.CellKeyTest)java.lang.OutOfMemoryError: Java
heap space
     [java] 16)
testAll(mondrian.rolap.RolapResultTest)java.lang.OutOfMemoryError: Java heap
space
     [java] 17)
testD1(mondrian.rolap.RolapResultTest)java.lang.OutOfMemoryError: Java heap
space
     [java] 18)
testD2(mondrian.rolap.RolapResultTest)java.lang.OutOfMemoryError: Java heap
space
     [java] 19)
testNonAllPromotionMembers(mondrian.rolap.RolapResultTest)java.lang.OutOfMem
oryError: Java heap space
     [java] 20)
testVirtualCube(mondrian.rolap.SharedDimensionTest)java.lang.OutOfMemoryErro
r: Java heap space
     [java] 21)
testStoreCube(mondrian.rolap.SharedDimensionTest)java.lang.OutOfMemoryError:
Java heap space
     [java] 22)
testA(mondrian.rolap.SharedDimensionTest)java.lang.OutOfMemoryError: Java
heap space
     [java] 23)
testB(mondrian.rolap.SharedDimensionTest)java.lang.OutOfMemoryError: Java
heap space
     [java] 24)
testNECJMemberList(mondrian.rolap.SharedDimensionTest)java.lang.OutOfMemoryE
rror: Java heap space
     [java] 25)
testNECJMultiLevelMemberList(mondrian.rolap.SharedDimensionTest)java.lang.Ou
tOfMemoryError: Java heap space
     [java] 26)
testSF1711865(mondrian.rolap.SharedDimensionTest)java.lang.OutOfMemoryError:
Java heap space
     [java] 27)
testHasCellPropertyWhenQueryHasCellProperties(mondrian.olap.QueryTest)java.l
ang.OutOfMemoryError: Java heap space
     [java] 28)
testIsCellPropertyEmpty(mondrian.olap.QueryTest)java.lang.OutOfMemoryError:
Java heap space
     [java] 29)
testGetCubesWithNoHrCubes(mondrian.rolap.RolapSchemaReaderTest)java.lang.Out
OfMemoryError: Java heap space
     [java] 30)
testGetCubesWithNoRole(mondrian.rolap.RolapSchemaReaderTest)java.lang.OutOfM
emoryError: Java heap space
     [java] 31)
testGetCubesForCaliforniaManager(mondrian.rolap.RolapSchemaReaderTest)java.l
ang.OutOfMemoryError: Java heap space
     [java] 32)
testProcessFormatStringAttributeToIgnoreNullFormatString(mondrian.rolap.Rola
pCubeTest)java.lang.OutOfMemoryError: Java heap space
     [java] 33)
testProcessFormatStringAttribute(mondrian.rolap.RolapCubeTest)java.lang.OutO
fMemoryError: Java heap space
     [java] 34)
testGetCalculatedMembersWithNoRole(mondrian.rolap.RolapCubeTest)java.lang.Ou
tOfMemoryError: Java heap space
     [java] 35)
testGetCalculatedMembersForCaliforniaManager(mondrian.rolap.RolapCubeTest)ja
va.lang.OutOfMemoryError: Java heap space
     [java] 36)
testGetCalculatedMembersReturnsOnlyAccessibleMembers(mondrian.rolap.RolapCub
eTest)java.lang.OutOfMemoryError: Java heap space
     [java] 37)
testGetCalculatedMembersReturnsOnlyAccessibleMembersForHierarchy(mondrian.ro
lap.RolapCubeTest)java.lang.OutOfMemoryError: Java heap space
     [java] 38)
testGetCalculatedMembersReturnsOnlyAccessibleMembersForLevel(mondrian.rolap.
RolapCubeTest)java.lang.OutOfMemoryError: Java heap space
     [java] 39)
testClosingPeriodMemberLeafWithCustomNullRepresentation(mondrian.olap.NullMe
mberRepresentationTest)java.lang.OutOfMemoryError: Java heap space
     [java] 40)
testItemMemberWithCustomNullMemberRepresentation(mondrian.olap.NullMemberRep
resentationTest)java.lang.OutOfMemoryError: Java heap space
     [java] 41)
testNullMemberWithCustomRepresentation(mondrian.olap.NullMemberRepresentatio
nTest)java.lang.OutOfMemoryError: Java heap space
     [java] 42)
testTotalingOnCrossJoinOfJoiningAndNonJoiningDimensions(mondrian.test.Ignore
UnrelatedDimensionsTest)java.lang.OutOfMemoryError: Java heap space
     [java] 43)
testVMShouldNotPushUpAggregateMemberDefinedOnNonJoiningDimension(mondrian.te
st.IgnoreUnrelatedDimensionsTest)java.lang.OutOfMemoryError: Java heap space
     [java] 44)
testAggregateMemberDefinedOnNonJoiningDimensionWithNonAllDefaultMember(mondr
ian.test.IgnoreUnrelatedDimensionsTest)java.lang.OutOfMemoryError: Java heap
space
     [java] 45)
testTotalingForValidAndNonValidMeasuresWithJoiningDimensions(mondrian.test.I
gnoreUnrelatedDimensionsTest)java.lang.OutOfMemoryError: Java heap space
     [java] 46)
testTotalingWhenIgnoreUnrelatedDimensionsPropertyIsTrue(mondrian.test.Ignore
UnrelatedDimensionsTest)java.lang.OutOfMemoryError: Java heap space
     [java] 47)
testTotalingOnNonJoiningDimension(mondrian.test.IgnoreUnrelatedDimensionsTes
t)java.lang.OutOfMemoryError: Java heap space
     [java] 48)
testStrMeasure(mondrian.rolap.NonEmptyTest)java.lang.OutOfMemoryError: Java
heap space
     [java] 49)
testBug1515302(mondrian.rolap.NonEmptyTest)java.lang.OutOfMemoryError: Java
heap space
     [java] 50)
testVirtualCubeMembersNonConformingDim(mondrian.rolap.NonEmptyTest)java.lang
.OutOfMemoryError: Java heap space
     [java] 51)
testNonNativeFilterWithNullMeasure(mondrian.rolap.NonEmptyTest)java.lang.Out
OfMemoryError: Java heap space
     [java] 52)
testNativeFilterWithNullMeasure(mondrian.rolap.NonEmptyTest)java.lang.OutOfM
emoryError: Java heap space
     [java] 53)
testNonNativeFilterWithCalcMember(mondrian.rolap.NonEmptyTest)java.lang.OutO
fMemoryError: Java heap space
     [java] 54)
testExpandAllMembersInAllInputs(mondrian.rolap.NonEmptyTest)java.lang.OutOfM
emoryError: Java heap space
     [java] 55)
testExpandCalcMembersInAllInputs(mondrian.rolap.NonEmptyTest)java.lang.OutOf
MemoryError: Java heap space
     [java] 56)
testExpandLowMaxConstraints(mondrian.rolap.NonEmptyTest)java.lang.OutOfMemor
yError: Java heap space
     [java] 57)
testExpandDifferentLevels(mondrian.rolap.NonEmptyTest)java.lang.OutOfMemoryE
rror: Java heap space
     [java] 58)
testExpandTupleInputs(mondrian.rolap.NonEmptyTest)java.lang.OutOfMemoryError
: Java heap space
     [java] 59)
testEnumLowMaxConstraints(mondrian.rolap.NonEmptyTest)java.lang.OutOfMemoryE
rror: Java heap space
     [java] 60)
testAllMembersNECJ1(mondrian.rolap.NonEmptyTest)java.lang.OutOfMemoryError:
Java heap space
     [java] 61)
testMeasureAndAggregateInSlicer(mondrian.rolap.NonEmptyTest)java.lang.OutOfM
emoryError: Java heap space
     [java] 62)
testMeasureInSlicer(mondrian.rolap.NonEmptyTest)java.lang.OutOfMemoryError:
Java heap space
     [java] 63)
testCmInTopCount(mondrian.rolap.NonEmptyTest)java.lang.OutOfMemoryError:
Java heap space
     [java] 64)
testCmInSlicer(mondrian.rolap.NonEmptyTest)java.lang.OutOfMemoryError: Java
heap space
     [java] 65)
testCjDescendantsEnumAll(mondrian.rolap.NonEmptyTest)java.lang.OutOfMemoryEr
ror: Java heap space
     [java] 66)
testMultiLevelMemberConstraintNonNullParent(mondrian.rolap.NonEmptyTest)java
.lang.OutOfMemoryError: Java heap space
     [java] 67)
testMultiLevelMemberConstraintNullParent(mondrian.rolap.NonEmptyTest)java.la
ng.OutOfMemoryError: Java heap space
     [java] 68)
testMultiLevelMemberConstraintMixedNullNonNullParent(mondrian.rolap.NonEmpty
Test)java.lang.OutOfMemoryError: Java heap space
     [java] 69)
testMultiLevelMemberConstraintWithMixedNullNonNullChild(mondrian.rolap.NonEm
ptyTest)java.lang.OutOfMemoryError: Java heap space
     [java] 70)
testNonEmptyUnionQuery(mondrian.rolap.NonEmptyTest)java.lang.OutOfMemoryErro
r: Java heap space
     [java] 71)
testLookupMember(mondrian.rolap.NonEmptyTest)java.lang.OutOfMemoryError:
Java heap space
     [java] 72)
testNonEmptyCrossJoinList(mondrian.rolap.NonEmptyTest)java.lang.OutOfMemoryE
rror: Java heap space
     [java] 73)
testLookupMember2(mondrian.rolap.NonEmptyTest)java.lang.OutOfMemoryError:
Java heap space
     [java] 74)
testCalcMemberWithNonEmptyCrossJoin(mondrian.rolap.NonEmptyTest)java.lang.Ou
tOfMemoryError: Java heap space
     [java] 75)
testLevelMembersWithoutNonEmpty(mondrian.rolap.NonEmptyTest)java.lang.OutOfM
emoryError: Java heap space
     [java] 76)
testDimensionMembers(mondrian.rolap.NonEmptyTest)java.lang.OutOfMemoryError:
Java heap space
     [java] 77)
testMemberChildrenOfRolapMember(mondrian.rolap.NonEmptyTest)java.lang.OutOfM
emoryError: Java heap space
     [java] 78)
testMemberChildrenOfAllMember(mondrian.rolap.NonEmptyTest)java.lang.OutOfMem
oryError: Java heap space
     [java] 79)
testMemberChildrenNoWhere(mondrian.rolap.NonEmptyTest)java.lang.OutOfMemoryE
rror: Java heap space
     [java] 80)
testBug1412384(mondrian.rolap.NonEmptyTest)java.lang.OutOfMemoryError: Java
heap space
     [java] 81)
testVirtualCubeCrossJoinNonConformingDim(mondrian.rolap.NonEmptyTest)java.la
ng.OutOfMemoryError: Java heap space
     [java] 82)
testNotNativeVirtualCubeCrossJoin1(mondrian.rolap.NonEmptyTest)java.lang.Out
OfMemoryError: Java heap space
     [java] 83)
testNotNativeVirtualCubeCrossJoin2(mondrian.rolap.NonEmptyTest)java.lang.Out
OfMemoryError: Java heap space
     [java] 84)
testNotNativeVirtualCubeCrossJoinCalculatedMember(mondrian.rolap.NonEmptyTes
t)java.lang.OutOfMemoryError: Java heap space
     [java] 85)
testCjEnumCalcMembersBug(mondrian.rolap.NonEmptyTest)java.lang.OutOfMemoryEr
ror: Java heap space
     [java] 86)
testCrossJoinEvaluatorContext1(mondrian.rolap.NonEmptyTest)java.lang.OutOfMe
moryError: Java heap space
     [java] 87)
testCrossJoinEvaluatorContext2(mondrian.rolap.NonEmptyTest)java.lang.OutOfMe
moryError: Java heap space
     [java] 88)
testVCNativeCJWithIsEmptyOnMeasure(mondrian.rolap.NonEmptyTest)java.lang.Out
OfMemoryError: Java heap space
     [java] 89)
testIndependentSlicerMemberNonNative(mondrian.rolap.NonEmptyTest)java.lang.O
utOfMemoryError: Java heap space
     [java] 90)
testIndependentSlicerMemberNative(mondrian.rolap.NonEmptyTest)java.lang.OutO
fMemoryError: Java heap space
     [java] 91)
testDependentSlicerMemberNonNative(mondrian.rolap.NonEmptyTest)java.lang.Out
OfMemoryError: Java heap space
     [java] 92)
testDependentSlicerMemberNative(mondrian.rolap.NonEmptyTest)java.lang.OutOfM
emoryError: Java heap space
     [java] 93)
testDoesDBSupportGroupingSets(mondrian.rolap.FastBatchingCellReaderTest)java
.lang.OutOfMemoryError: Java heap space
     [java] 94)
testGroupBatchesForNonGroupableBatchesWithSorting(mondrian.rolap.FastBatchin
gCellReaderTest)java.lang.OutOfMemoryError: Java heap space
     [java] 95)
testGroupBatchesForNonGroupableBatchesWithConstraints(mondrian.rolap.FastBat
chingCellReaderTest)java.lang.OutOfMemoryError: Java heap space
     [java] 96)
testGroupBatchesForGroupableBatches(mondrian.rolap.FastBatchingCellReaderTes
t)java.lang.OutOfMemoryError: Java heap space
     [java] 97)
testGroupBatchesForGroupableBatchesAndNonGroupableBatches(mondrian.rolap.Fas
tBatchingCellReaderTest)java.lang.OutOfMemoryError: Java heap space
     [java] 98)
testGroupBatchesForTwoSetOfGroupableBatches(mondrian.rolap.FastBatchingCellR
eaderTest)java.lang.OutOfMemoryError: Java heap space
     [java] 99)
testAddToCompositeBatchForBothBatchesNotPartOfCompositeBatch(mondrian.rolap.
FastBatchingCellReaderTest)java.lang.OutOfMemoryError: Java heap space
     [java] 100)
testAddToCompositeBatchForDetailedBatchAlreadyPartOfACompositeBatch(mondrian
.rolap.FastBatchingCellReaderTest)java.lang.OutOfMemoryError: Java heap
space
     [java] 101)
testAddToCompositeBatchForAggregationBatchAlreadyPartOfACompositeBatch(mondr
ian.rolap.FastBatchingCellReaderTest)java.lang.OutOfMemoryError: Java heap
space
     [java] 102)
testAddToCompositeBatchForBothBatchAlreadyPartOfACompositeBatch(mondrian.rol
ap.FastBatchingCellReaderTest)java.lang.OutOfMemoryError: Java heap space
     [java] 103)
testCanBatchForBatchWithSuperSetOfContraintColumnBitKeyAndAllValuesForAdditi
onalCondition(mondrian.rolap.FastBatchingCellReaderTest)java.lang.OutOfMemor
yError: Java heap space
     [java] 104)
testCanBatchForBatchWithConstraint(mondrian.rolap.FastBatchingCellReaderTest
)
Running test with JDK=jdk1.6 retroweave= database=derby props={
mondrian.native.crossjoin.enable=false mondrian.native.topcount.enable=false
mondrian.native.nonempty.enable=false
mondrian.xmla.drillthroughTotalCount.enable=false}
     [java] OK (1470 tests)
Running test with JDK=jdk1.5 retroweave=true database=oracle props={
mondrian.rolap.aggregates.Use=true mondrian.rolap.aggregates.Read=true
mondrian.olap.case.sensitive=false mondrian.test.ExpDependencies=10
mondrian.rolap.evaluate.MaxEvalDepth=6
mondrian.rolap.evaluate.MaxEvalDepth=6
mondrian.rolap.star.disableCaching=true
mondrian.native.topcount.enable=false mondrian.native.filter.enable=false
mondrian.native.nonempty.enable=false
mondrian.xmla.drillthroughTotalCount.enable=false
mondrian.rolap.LargeDimensionThreshold=25000}
     [java] 1)
testRollupPolicySimultaneous(mondrian.test.AccessControlTest)mondrian.olap.M
ondrianException: Mondrian Error:Internal error: Error while executing query
[with member [Measures].[Foo] as '[Measures].[Unit Sales]'
     [java] 2)
testHierarchyAbbreviatedDefaultMember(mondrian.test.SchemaTest)java.lang.Out
OfMemoryError: Java heap space
     [java] 	at
mondrian.rolap.aggmatcher.DefaultRules.columnsOK(DefaultRules.java:447)
     [java] 3)
testHierarchyDefaultMember(mondrian.test.SchemaTest)java.lang.OutOfMemoryErr
or: Java heap space
     [java] 4)
testMultipleDimensionUsages(mondrian.test.SchemaTest)java.lang.OutOfMemoryEr
ror: Java heap space
     [java] 5)
testSolveOrderInCalculatedMember(mondrian.test.SchemaTest)java.lang.OutOfMem
oryError: Java heap space
     [java] 6)
testTwoAliasesDimensionsShareTable(mondrian.test.SchemaTest)java.lang.OutOfM
emoryError: Java heap space
     [java] 7)
testTwoAliasesDimensionsShareTableSameForeignKeys(mondrian.test.SchemaTest)j
ava.lang.OutOfMemoryError: Java heap space
     [java] 8)
testUnknownUsages(mondrian.test.SchemaTest)java.lang.OutOfMemoryError: Java
heap space
     [java] 9)
testUnknownUsages1(mondrian.test.SchemaTest)java.lang.OutOfMemoryError: Java
heap space
     [java] 10)
testViewFactTable(mondrian.test.SchemaTest)java.lang.OutOfMemoryError: Java
heap space
     [java] 11)
testViewFactTable2(mondrian.test.SchemaTest)java.lang.OutOfMemoryError: Java
heap space
     [java] 12)
testGroupingSetForASummaryCanBeGroupedWith2DetailBatch(mondrian.rolap.Groupi
ngSetQueryTest)java.lang.OutOfMemoryError: Java heap space
     [java] 13)
testGroupingSetForMultipleColumnConstraint(mondrian.rolap.GroupingSetQueryTe
st)java.lang.OutOfMemoryError: Java heap space
     [java] 14)
testGroupingSetForMultipleColumnConstraintAndCompoundConstraint(mondrian.rol
ap.GroupingSetQueryTest)java.lang.OutOfMemoryError: Java heap space
     [java] 15)
testGroupingSetForMultipleMeasureAndSingleConstraint(mondrian.rolap.Grouping
SetQueryTest)java.lang.OutOfMemoryError: Java heap space
     [java] 16)
testGroupingSetForSingleColumnConstraint(mondrian.rolap.GroupingSetQueryTest
)java.lang.OutOfMemoryError: Java heap space
     [java] 17)
testNotUsingGroupingSet(mondrian.rolap.GroupingSetQueryTest)java.lang.OutOfM
emoryError: Java heap space
     [java] 18)
testNotUsingGroupingSetWhenGroupUsesDifferentAggregateTable(mondrian.rolap.G
roupingSetQueryTest)java.lang.OutOfMemoryError: Java heap space
     [java] 19)
test7731(mondrian.test.CmdRunnerTest)java.lang.OutOfMemoryError: Java heap
space
     [java] 20)
testQuery(mondrian.test.CmdRunnerTest)java.lang.OutOfMemoryError: Java heap
space
     [java] 21)
testParallelDataSourceChangeListenerPlugin(mondrian.rolap.DataSourceChangeLi
stenerTest)java.lang.OutOfMemoryError: Java heap space
     [java] 22)
testCellLookup(mondrian.rolap.CellKeyTest)java.lang.OutOfMemoryError: Java
heap space
     [java] 23)
testAll(mondrian.rolap.RolapResultTest)java.lang.OutOfMemoryError: Java heap
space
     [java] 24)
testD1(mondrian.rolap.RolapResultTest)java.lang.OutOfMemoryError: Java heap
space
     [java] 25)
testD2(mondrian.rolap.RolapResultTest)java.lang.OutOfMemoryError: Java heap
space
     [java] 26)
testNonAllPromotionMembers(mondrian.rolap.RolapResultTest)java.lang.OutOfMem
oryError: Java heap space
     [java] 27)
testStoreCube(mondrian.rolap.SharedDimensionTest)java.lang.OutOfMemoryError:
Java heap space
     [java] 28)
testVirtualCube(mondrian.rolap.SharedDimensionTest)java.lang.OutOfMemoryErro
r: Java heap space
     [java] 29)
testA(mondrian.rolap.SharedDimensionTest)java.lang.OutOfMemoryError: Java
heap space
     [java] 30)
testB(mondrian.rolap.SharedDimensionTest)java.lang.OutOfMemoryError: Java
heap space
     [java] 31)
testNECJMemberList(mondrian.rolap.SharedDimensionTest)java.lang.OutOfMemoryE
rror: Java heap space
     [java] 32)
testNECJMultiLevelMemberList(mondrian.rolap.SharedDimensionTest)java.lang.Ou
tOfMemoryError: Java heap space
     [java] 33)
testSF1711865(mondrian.rolap.SharedDimensionTest)java.lang.OutOfMemoryError:
Java heap space
     [java] 34)
testHasCellPropertyWhenQueryHasCellProperties(mondrian.olap.QueryTest)java.l
ang.OutOfMemoryError: Java heap space
     [java] 35)
testIsCellPropertyEmpty(mondrian.olap.QueryTest)java.lang.OutOfMemoryError:
Java heap space
     [java] 36)
testGetCubesForCaliforniaManager(mondrian.rolap.RolapSchemaReaderTest)java.l
ang.OutOfMemoryError: Java heap space
     [java] 37)
testGetCubesWithNoHrCubes(mondrian.rolap.RolapSchemaReaderTest)java.lang.Out
OfMemoryError: Java heap space
     [java] 38)
testGetCubesWithNoRole(mondrian.rolap.RolapSchemaReaderTest)java.lang.OutOfM
emoryError: Java heap space
     [java] 39)
testGetCalculatedMembersForCaliforniaManager(mondrian.rolap.RolapCubeTest)ja
va.lang.OutOfMemoryError: Java heap space
     [java] 40)
testGetCalculatedMembersReturnsOnlyAccessibleMembers(mondrian.rolap.RolapCub
eTest)java.lang.OutOfMemoryError: Java heap space
     [java] 41)
testGetCalculatedMembersReturnsOnlyAccessibleMembersForHierarchy(mondrian.ro
lap.RolapCubeTest)java.lang.OutOfMemoryError: Java heap space
     [java] 42)
testGetCalculatedMembersReturnsOnlyAccessibleMembersForLevel(mondrian.rolap.
RolapCubeTest)java.lang.OutOfMemoryError: Java heap space
     [java] 43)
testGetCalculatedMembersWithNoRole(mondrian.rolap.RolapCubeTest)java.lang.Ou
tOfMemoryError: Java heap space
     [java] 44)
testProcessFormatStringAttribute(mondrian.rolap.RolapCubeTest)java.lang.OutO
fMemoryError: Java heap space
     [java] 45)
testProcessFormatStringAttributeToIgnoreNullFormatString(mondrian.rolap.Rola
pCubeTest)java.lang.OutOfMemoryError: Java heap space
     [java] 46)
testClosingPeriodMemberLeafWithCustomNullRepresentation(mondrian.olap.NullMe
mberRepresentationTest)java.lang.OutOfMemoryError: Java heap space
     [java] 47)
testItemMemberWithCustomNullMemberRepresentation(mondrian.olap.NullMemberRep
resentationTest)java.lang.OutOfMemoryError: Java heap space
     [java] 48)
testNullMemberWithCustomRepresentation(mondrian.olap.NullMemberRepresentatio
nTest)java.lang.OutOfMemoryError: Java heap space
     [java] 49)
testAggregateMemberDefinedOnNonJoiningDimensionWithNonAllDefaultMember(mondr
ian.test.IgnoreUnrelatedDimensionsTest)java.lang.OutOfMemoryError: Java heap
space
     [java] 50)
testTotalingForValidAndNonValidMeasuresWithJoiningDimensions(mondrian.test.I
gnoreUnrelatedDimensionsTest)java.lang.OutOfMemoryError: Java heap space
     [java] 51)
testTotalingOnCrossJoinOfJoiningAndNonJoiningDimensions(mondrian.test.Ignore
UnrelatedDimensionsTest)java.lang.OutOfMemoryError: Java heap space
     [java] 52)
testTotalingOnNonJoiningDimension(mondrian.test.IgnoreUnrelatedDimensionsTes
t)java.lang.OutOfMemoryError: Java heap space
     [java] 53)
testTotalingWhenIgnoreUnrelatedDimensionsPropertyIsTrue(mondrian.test.Ignore
UnrelatedDimensionsTest)java.lang.OutOfMemoryError: Java heap space
     [java] 54)
testVMShouldNotPushUpAggregateMemberDefinedOnNonJoiningDimension(mondrian.te
st.IgnoreUnrelatedDimensionsTest)java.lang.OutOfMemoryError: Java heap space
     [java] 55)
testAddToCompositeBatchForAggregationBatchAlreadyPartOfACompositeBatch(mondr
ian.rolap.FastBatchingCellReaderTest)java.lang.OutOfMemoryError: Java heap
space
     [java] 56)
testAddToCompositeBatchForBothBatchAlreadyPartOfACompositeBatch(mondrian.rol
ap.FastBatchingCellReaderTest)java.lang.OutOfMemoryError: Java heap space
     [java] 57)
testAddToCompositeBatchForBothBatchesNotPartOfCompositeBatch(mondrian.rolap.
FastBatchingCellReaderTest)java.lang.OutOfMemoryError: Java heap space
     [java] 58)
testAddToCompositeBatchForDetailedBatchAlreadyPartOfACompositeBatch(mondrian
.rolap.FastBatchingCellReaderTest)java.lang.OutOfMemoryError: Java heap
space
     [java] 59)
testAggregateDistinctCount(mondrian.rolap.FastBatchingCellReaderTest)java.la
ng.OutOfMemoryError: Java heap space
     [java] 60)
testAggregateDistinctCount2(mondrian.rolap.FastBatchingCellReaderTest)java.l
ang.OutOfMemoryError: Java heap space
     [java] 61)
testAggregateDistinctCount3(mondrian.rolap.FastBatchingCellReaderTest)java.l
ang.OutOfMemoryError: Java heap space
     [java] 62)
testAggregateDistinctCount4(mondrian.rolap.FastBatchingCellReaderTest)java.l
ang.OutOfMemoryError: Java heap space
     [java] 63)
testAggregateDistinctCount5(mondrian.rolap.FastBatchingCellReaderTest)java.l
ang.OutOfMemoryError: Java heap space
     [java] 64)
testAggregateDistinctCountInDimensionFilter(mondrian.rolap.FastBatchingCellR
eaderTest)java.lang.OutOfMemoryError: Java heap space
     [java] 65)
testCanBatchForBatchWithConstraint(mondrian.rolap.FastBatchingCellReaderTest
)java.lang.OutOfMemoryError: Java heap space
     [java] 66)
testCanBatchForBatchWithConstraint2(mondrian.rolap.FastBatchingCellReaderTes
t)java.lang.OutOfMemoryError: Java heap space
     [java] 67)
testCanBatchForBatchWithDifferentAggregationTable(mondrian.rolap.FastBatchin
gCellReaderTest)java.lang.OutOfMemoryError: Java heap space
     [java] 68)
testCanBatchForBatchWithDistinctCountInAggregateBatch(mondrian.rolap.FastBat
chingCellReaderTest)java.lang.OutOfMemoryError: Java heap space
     [java] 69)
testCanBatchForBatchWithDistinctCountInDetailedBatch(mondrian.rolap.FastBatc
hingCellReaderTest)java.lang.OutOfMemoryError: Java heap space
     [java] 70)
testCanBatchForBatchWithNonSuperSetOfContraintColumnBitKeyAndAllValuesForAdd
itionalCondition(mondrian.rolap.FastBatchingCellReaderTest)java.lang.OutOfMe
moryError: Java heap space
     [java] 71)
testCanBatchForBatchWithSuperSetOfContraintColumnBitKeyAndAllValuesForAdditi
onalCondition(mondrian.rolap.FastBatchingCellReaderTest)java.lang.OutOfMemor
yError: Java heap space
     [java] 72)
testCanBatchForBatchWithSuperSetOfContraintColumnBitKeyAndDifferentValuesFor
OverlappingColumns(mondrian.rolap.FastBatchingCellReaderTest)java.lang.OutOf
MemoryError: Java heap space
     [java] 73)
testCanBatchForBatchWithSuperSetOfContraintColumnBitKeyAndNOTAllValuesForAdd
itionalCondition(mondrian.rolap.FastBatchingCellReaderTest)java.lang.OutOfMe
moryError: Java heap space
     [java] 74)
testCanBatchForBatchesFromSameAggregationButDifferentRollupOption(mondrian.r
olap.FastBatchingCellReaderTest)java.lang.OutOfMemoryError: Java heap space
     [java] 75)
testCompositeBatchLoadAggregation(mondrian.rolap.FastBatchingCellReaderTest)
java.lang.OutOfMemoryError: Java heap space
     [java] 76)
testDistinctCountBug1785406(mondrian.rolap.FastBatchingCellReaderTest)java.l
ang.OutOfMemoryError: Java heap space
     [java] 77)
testDistinctCountBug1785406_2(mondrian.rolap.FastBatchingCellReaderTest)java
.lang.OutOfMemoryError: Java heap space
     [java] 78)
testDoesDBSupportGroupingSets(mondrian.rolap.FastBatchingCellReaderTest)java
.lang.OutOfMemoryError: Java heap space
     [java] 79)
testGroupBatchesForGroupableBatches(mondrian.rolap.FastBatchingCellReaderTes
t)java.lang.OutOfMemoryError: Java heap space
     [java] 80)
testGroupBatchesForGroupableBatchesAndNonGroupableBatches(mondrian.rolap.Fas
tBatchingCellReaderTest)java.lang.OutOfMemoryError: Java heap space
     [java] 81)
testGroupBatchesForNonGroupableBatchesWithConstraints(mondrian.rolap.FastBat
chingCellReaderTest)java.lang.OutOfMemoryError: Java heap space
     [java] 82)
testGroupBatchesForNonGroupableBatchesWithSorting(mondrian.rolap.FastBatchin
gCellReaderTest)java.lang.OutOfMemoryError: Java heap space
     [java] 83)
testGroupBatchesForTwoSetOfGroupableBatches(mondrian.rolap.FastBatchingCellR
eaderTest)java.lang.OutOfMemoryError: Java heap space
     [java] 84)
testLoadDistinctSqlMeasure(mondrian.rolap.FastBatchingCellReaderTest)java.la
ng.OutOfMemoryError: Java heap space
     [java] 85)
testDoubleInList(mondrian.rolap.sql.SqlQueryTest)java.lang.OutOfMemoryError:
Java heap space
     [java] 86)
testPredicatesAreNotOptimizedWhenPropertyIsFalse(mondrian.rolap.sql.SqlQuery
Test)java.lang.OutOfMemoryError: Java heap space
     [java] 87)
testPredicatesAreOptimizedWhenAllTheMembersAreIncluded(mondrian.rolap.sql.Sq
lQueryTest)java.lang.OutOfMemoryError: Java heap space
     [java] 88)
testPredicatesAreOptimizedWhenPropertyIsTrue(mondrian.rolap.sql.SqlQueryTest
)java.lang.OutOfMemoryError: Java heap space
     [java] 89)
testToStringForGroupingSetSqlWithEmptyGroup(mondrian.rolap.sql.SqlQueryTest)
java.lang.OutOfMemoryError: Java heap space
     [java] 90)
testToStringForMultipleGroupingSetsSql(mondrian.rolap.sql.SqlQueryTest)java.
lang.OutOfMemoryError: Java heap space
     [java] 91)
testToStringForSingleGroupingSetSql(mondrian.rolap.sql.SqlQueryTest)java.lan
g.OutOfMemoryError: Java heap space
     [java] 92)
testBatchedFill1(mondrian.test.clearview.BatchedFillTest)java.lang.OutOfMemo
ryError: Java heap space
     [java] 93)
testBatchedFill2(mondrian.test.clearview.BatchedFillTest)java.lang.OutOfMemo
ryError: Java heap space
     [java] 1)
testHierarchyBadDefaultMember(mondrian.test.SchemaTest)junit.framework.Asser
tionFailedError: query's error does not match pattern 'Can not find Default
Member with name "[Gender with default].[Non].[Existent]" in Hierarchy
"Gender with default"'; error is [java.lang.OutOfMemoryError: Java heap
space
     [java] 2) testInvalidAggregator(mondrian.test.SchemaTest)
     [java] FAILURES!!!
     [java] Tests run: 1571,  Failures: 2,  Errors: 1
     [java] FAILURES!!!
     [java] Tests run: 1571,  Failures: 2,  Errors: 1
     [java] FAILURES!!!
     [java] Tests run: 1571,  Failures: 0,  Errors: 1
     [java] FAILURES!!!
     [java] Tests run: 34,  Failures: 34,  Errors: 0
     [java] FAILURES!!!
     [java] Tests run: 1571,  Failures: 2,  Errors: 1
     [java] FAILURES!!!
     [java] Tests run: 1571,  Failures: 0,  Errors: 7
     [java] FAILURES!!!
     [java] Tests run: 1571,  Failures: 0,  Errors: 1
     [java] FAILURES!!!
     [java] Tests run: 1571,  Failures: 0,  Errors: 2
     [java] FAILURES!!!
     [java] Tests run: 1571,  Failures: 2,  Errors: 1
     [java] FAILURES!!!
     [java] Tests run: 1571,  Failures: 0,  Errors: 7
     [java] FAILURES!!!
     [java] Tests run: 1470,  Failures: 115,  Errors: 1149
     [java] FAILURES!!!
     [java] Tests run: 1472,  Failures: 2,  Errors: 65
     [java] FAILURES!!!
     [java] Tests run: 1470,  Failures: 2,  Errors: 1
     [java] FAILURES!!!
     [java] Tests run: 1571,  Failures: 2,  Errors: 2
     [java] FAILURES!!!
     [java] Tests run: 1470,  Failures: 1,  Errors: 1
There were failures.

-------------- next part --------------
A non-text attachment was scrubbed...
Name: megatest.log.gz
Type: application/x-gzip
Size: 136181 bytes
Desc: not available
Url : http://lists.pentaho.org/pipermail/mondrian/attachments/20071217/0956231d/attachment.gz 


More information about the Mondrian mailing list